{"text_format":"1","workbook":"xlsx","n_sheets":5,"sheets":["Instructions","Roster","Duty Roster","Calculator","Tables"],"not_rendered":{"charts":0,"images":1,"macros":1,"external_links":0,"defined_names":24,"comments":0,"pivot_tables":0},"unopened":[],"bounds":{"document_bytes":16777216,"sheet_cells":100000,"rows_first":2000,"rows_last":500,"rows_between":2000,"halvings":0,"cell_chars":16384,"cell_head_chars":4096},"cells_cut":0,"cells_raw":0,"read":"whole","date_system":"1900"}

{"sheet":"Instructions","index":0,"n_rows":13,"n_cols":3,"rows_kept":13,"cut":false,"hidden":false,"merged":[[12,0,12,2],[8,0,8,2],[2,0,2,2],[0,0,0,2],[11,0,11,2],[1,0,1,2]]}
["Philmont Trek Duty Roster Instructions"]
["12-Day Treks"]
["This spreadsheet was developed to produce duty rosters for a Philmont Trek.  Any number of participants may be included in the Duty Roster (up to the crew maximum size of 12).  The spreadsheet has a number of \"tabs\" for different worksheets.  These are used as follows:"]
[1,"Instructions","This worksheet, instructions on using the spreadsheet."]
[2,"Roster","    This is the worksheet where information is entered.  Move between cells by using the TAB key.  Information is entered in the cells that are shaded light green.\n    Enter the names of the crewmembers that will have duty roster duties (last name first, separated with a comma).  After the names have been entered, enter the crew member number in the grid for job assignments (i.e., 1, 2, ...4, etc.).  Up to two crew members may be assigned to a job on any given day.\n    As you enter crew member numbers in the grid, the total number of job assignments they have will show in gray to the right of their name and the \ntable below the entry area will show a running total of assignments by person & job.\n    The campsites are based on the Philmont 2024 Itinerary Guidebook and are updated when you enter your itinerary number."]
[3,"Duty Roster","This worksheet is the printable duty roster.  It is formatted for 8-1/2 x 11 paper in landscape mode.  It is suggested that a copy be printed and laminated (possibly reduced in size) for each member of the crew."]
[4,"Calculator","This is an internal worksheet that has no user information.  It is used for the internal calculations.\n "]
[5,"Tables","This is an internal (hidden) worksheet that has no user information.  It contains the list of camps and food pickups for itineraries as well as the entire camp list."]
["The cells in the worksheets are \"locked\" so that you may only enter information in the \"unlocked\" cells.  To make changes to the spreadsheet or access \"locked\" cells, use the Tools/Protection/Unprotect sheet... menu command.  There are no passwords."]
[]
["If you have suggestions or recommendations for changes to this spreadsheet, please send "]
["them to Sid Covington by clicking on the Philmont arrowhead:"]
[{"$f":"getlastsavedate()","v":"1/8/2024 7:02PM"}]

{"sheet":"Roster","index":1,"n_rows":36,"n_cols":17,"rows_kept":36,"cut":false,"hidden":false,"merged":[[27,8,27,9],[33,8,33,9],[34,8,34,9],[28,8,28,9],[29,8,29,9],[30,8,30,9],[31,8,31,9],[32,8,32,9],[0,16,20,16],[24,3,24,4],[21,10,22,10],[17,3,17,4],[21,16,22,16],[22,6,35,6],[35,7,35,9],[21,15,22,15],[21,13,22,13],[21,8,22,9],[21,11,22,11],[21,7,22,7],[15,3,15,4],[16,3,16,4],[21,12,22,12],[23,8,23,9],[14,3,14,4],[25,8,25,9],[26,8,26,9],[18,3,18,4],[19,3,19,4],[20,3,20,4],[24,8,24,9],[22,1,26,1],[21,14,22,14],[21,3,21,4],[22,3,22,4],[23,3,23,4]]}
["#","Name","LastName","FirstName","Jobs",null,"Trek Day #","Day","Date","Campsite","Water","Stoves Fuel","Meal Cleanup","Site Setup","Bear Bags","Cook Dinner","Assign daily jobs to crewmembers by entering crewmember # \nin the job column for the day of the trek."]
[{"$f":"IF(ISBLANK(B2),\"\",1)","v":1},"Farkel, Fred",{"$f":"IF(ISBLANK(B2),\"\",LEFT(B2,SEARCH(\",\",B2)-1))","v":"Farkel"},{"$f":"IF(ISBLANK(B2),\"\",RIGHT(B2,LEN(B2)-SEARCH(\",\",B2)-1))","v":"Fred"},{"$f":"Calculator!I4","v":7},null,2,{"$f":"INDEX(week_days,WEEKDAY(I2,1),2)","v":"Sun"},{"$f":"Arrival+G2-1","v":"2024-06-09"},{"$f":"IF(VLOOKUP(INDEX(Campsite,G2-1),campInfo,2)=\"S\",UPPER(INDEX(Campsite,G2-1)),INDEX(Campsite,G2-1))","v":"Toothache Springs"},1,2,3,4,5,6]
[{"$f":"IF(ISBLANK(B3),\"\",A2+1)","v":2},"Jones, Davey",{"$f":"IF(ISBLANK(B3),\"\",LEFT(B3,SEARCH(\",\",B3)-1))","v":"Jones"},{"$f":"IF(ISBLANK(B3),\"\",RIGHT(B3,LEN(B3)-SEARCH(\",\",B3)-1))","v":"Davey"},{"$f":"Calculator!I5","v":7},null,null,null,null,null,7,8,9,10,11,12]
[{"$f":"IF(ISBLANK(B4),\"\",A3+1)","v":3},"Brown, Sam","Brown","Sam",{"$f":"Calculator!I6","v":7},null,3,{"$f":"INDEX(week_days,WEEKDAY(I4,1),2)","v":"Mon"},{"$f":"Arrival+G4-1","v":"2024-06-10"},{"$f":"IF(VLOOKUP(INDEX(Campsite,G4-1),campInfo,2)=\"S\",UPPER(INDEX(Campsite,G4-1)),INDEX(Campsite,G4-1))","v":"URRACA"},2,3,4,5,6,7]
[4,"Washington, George","Washington","George",{"$f":"Calculator!I7","v":7},null,null,null,null,null,8,9,10,11,12,1]
[5,"Kiddlehopper, Clem","Kiddlehopper","Clem",{"$f":"Calculator!I8","v":7},null,4,"Tue",{"$f":"Arrival+G6-1","v":"2024-06-11"},{"$f":"IF(VLOOKUP(INDEX(Campsite,G6-1),campInfo,2)=\"S\",UPPER(INDEX(Campsite,G6-1)),INDEX(Campsite,G6-1))","v":"Stockade Ridge"},3,4,5,6,7,8]
[6,"Bush, George W.","Bush","George W.",{"$f":"Calculator!I9","v":7},null,null,null,null,null,9,10,11,12,1,2]
[7,"Lincoln, Abe","Lincoln","Abe",{"$f":"Calculator!I10","v":7},null,5,{"$f":"INDEX(week_days,WEEKDAY(I8,1),2)","v":"Wed"},{"$f":"Arrival+G8-1","v":"2024-06-12"},{"$f":"IF(VLOOKUP(INDEX(Campsite,G8-1),campInfo,2)=\"S\",UPPER(INDEX(Campsite,G8-1)),INDEX(Campsite,G8-1))","v":"MINERS PARK"},4,5,6,7,8,9]
[8,"Eisenhower, Ike","Eisenhower","Ike",{"$f":"Calculator!I11","v":7},null,null,null,null,null,10,11,12,1,2,3]
[9,"Adams, John","Adams","John",{"$f":"Calculator!I12","v":7},null,6,{"$f":"INDEX(week_days,WEEKDAY(I10,1),2)","v":"Thu"},{"$f":"Arrival+G10-1","v":"2024-06-13"},{"$f":"IF(VLOOKUP(INDEX(Campsite,G10-1),campInfo,2)=\"S\",UPPER(INDEX(Campsite,G10-1)),INDEX(Campsite,G10-1))","v":"BLACK MOUNTAIN"},5,6,7,8,9,10]
[10,"Cody, Bill","Cody","Bill",{"$f":"Calculator!I13","v":7},null,null,null,null,null,11,12,1,2,3,4]
[11,"Phillips, Waite","Phillips","Waite",{"$f":"Calculator!I14","v":7},null,7,{"$f":"INDEX(week_days,WEEKDAY(I12,1),2)","v":"Fri"},{"$f":"Arrival+G12-1","v":"2024-06-14"},{"$f":"IF(VLOOKUP(INDEX(Campsite,G12-1),campInfo,2)=\"S\",UPPER(INDEX(Campsite,G12-1)),INDEX(Campsite,G12-1))","v":"BEAUBIEN"},6,7,8,9,10,11]
[12,"Custer, George","Custer","George",{"$f":"Calculator!I15","v":7},null,null,null,null,null,12,1,2,3,4,5]
[null,null,null,null,null,null,8,"Sat",{"$f":"Arrival+G14-1","v":"2024-06-15"},{"$f":"IF(VLOOKUP(INDEX(Campsite,G14-1),campInfo,2)=\"S\",UPPER(INDEX(Campsite,G14-1)),INDEX(Campsite,G14-1))","v":"Porcupine"},7,8,9,10,11,12]
[null,"Expedition #","Day #","Campsite for night",null,null,null,null,null,null,1,2,3,4,5,9]
[null,"608-A",2,{"$f":"INDEX(campsites,numericItinerary($B$22),C16-1)","v":"Toothache Springs"},null,null,9,"Sun",{"$f":"Arrival+G16-1","v":"2024-06-16"},{"$f":"IF(VLOOKUP(INDEX(Campsite,G16-1),campInfo,2)=\"S\",UPPER(INDEX(Campsite,G16-1)),INDEX(Campsite,G16-1))","v":"Divide"},8,9,10,11,12,1]
[null,"Unit #",3,{"$f":"INDEX(campsites,numericItinerary($B$22),C17-1)","v":"Urraca"},null,null,null,null,null,null,2,3,4,5,6,7]
[null,"Troop 123",4,{"$f":"INDEX(campsites,numericItinerary($B$22),C18-1)","v":"Stockade Ridge"},null,null,10,"Mon",{"$f":"Arrival+G18-1","v":"2024-06-17"},{"$f":"IF(VLOOKUP(INDEX(Campsite,G18-1),campInfo,2)=\"S\",UPPER(INDEX(Campsite,G18-1)),INDEX(Campsite,G18-1))","v":"CLEAR CREEK"},9,10,11,12,1,2]
[null,"Trek Arrival Day",5,{"$f":"INDEX(campsites,numericItinerary($B$22),C19-1)","v":"Miners Park"},null,null,null,null,null,null,3,4,5,6,7,8]
[null,{"$f":"LEFT(Expedition,1)&\"/\"&MID(Expedition,2,2)&\"/\"&getSpreadsheetProperty(\"trekYear\")","v":"6/08/2024"},6,{"$f":"INDEX(campsites,numericItinerary($B$22),C20-1)","v":"Black Mountain"},null,null,11,{"$f":"INDEX(week_days,WEEKDAY(I20,1),2)","v":"Tue"},{"$f":"Arrival+G20-1","v":"2024-06-18"},{"$f":"IF(VLOOKUP(INDEX(Campsite,G20-1),campInfo,2)=\"S\",UPPER(INDEX(Campsite,G20-1)),INDEX(Campsite,G20-1))","v":"Tolby Headwaters"},10,11,12,1,2,3]
[null,"Itinerary #",7,{"$f":"INDEX(campsites,numericItinerary($B$22),C21-1)","v":"Beaubien"},null,null,null,null,null,null,4,5,6,7,8,6]
[null,"12-1",8,{"$f":"INDEX(campsites,numericItinerary($B$22),C22-1)","v":"Porcupine"},null,null,null,"#","Name",null,{"$f":"K1","v":"Water"},"Stoves Fuel","Meal Cleanup","Site Setup","Bear Bags","Cook Dinner","Total"]
[null,{"$f":"IF(editItinerary(itineraryNumber),\"\",\"Itinerary number must be in the form of  \"\"\"  & getSpreadsheetProperty(\"nDays\") &  \"-\"\"\" & \"  followed by a number between 1 and \" & getSpreadsheetProperty(\"nItineraries\"))","v":""},9,{"$f":"INDEX(campsites,numericItinerary($B$22),C23-1)","v":"Divide"},null,null,"Number of Times Job Assigned"]
[null,null,10,{"$f":"INDEX(campsites,numericItinerary($B$22),C24-1)","v":"Clear Creek"},null,null,null,{"$f":"A2","v":1},{"$f":"B2","v":"Farkel, Fred"},null,{"$f":"COUNTIF(K$2:K$21,$H24)","v":2},1,1,2,2,2,{"$f":"SUM(K24:P24)","v":10}]
[null,null,11,{"$f":"INDEX(campsites,numericItinerary($B$22),C25-1)","v":"Tolby Headwaters"},null,null,null,2,"Jones, Davey",null,2,2,1,1,2,2,10]
[null,null,null,null,null,null,null,3,"Brown, Sam",null,2,2,2,1,1,2,10]
[null,null,null,null,null,null,null,4,"Washington, George",null,2,2,2,2,1,1,10]
[null,null,null,null,null,null,null,5,"Kiddlehopper, Clem",null,1,2,2,2,2,1,10]
[null,null,null,null,null,null,null,6,"Bush, George W.",null,1,1,2,2,2,2,10]
[null,null,null,null,null,null,null,7,"Lincoln, Abe",null,2,1,1,2,2,2,10]
[null,null,null,null,null,null,null,8,"Eisenhower, Ike",null,2,2,1,1,2,2,10]
[null,null,null,null,null,null,null,9,"Adams, John",null,2,2,2,1,1,2,10]
[null,null,null,null,null,null,null,10,"Cody, Bill",null,2,2,2,2,1,1,10]
[null,null,null,null,null,null,null,11,"Phillips, Waite",null,1,2,2,2,2,1,10]
[null,null,null,null,null,null,null,12,"Custer, George",null,1,1,2,2,2,2,10]
[null,null,null,null,null,null,null,"Total Assignments:",null,null,{"$f":"SUM(K24:K35)","v":20},{"$f":"SUM(L24:L35)","v":20},20,20,20,20,120]

{"sheet":"Duty Roster","index":2,"n_rows":23,"n_cols":14,"rows_kept":23,"cut":false,"hidden":false,"merged":[[21,7,22,7],[21,2,22,2],[21,4,22,4],[17,7,18,7],[19,7,20,7],[19,6,20,6],[17,4,18,4],[19,4,20,4],[19,5,20,5],[21,6,22,6],[19,0,20,0],[17,2,18,2],[19,2,20,2],[13,2,14,2],[19,1,20,1],[17,5,18,5],[17,6,18,6],[15,0,16,0],[17,0,18,0],[21,0,22,0],[21,1,22,1],[15,5,16,5],[21,5,22,5],[1,13,2,13],[3,0,4,0],[3,1,4,1],[3,2,4,2],[3,7,4,7],[13,7,14,7],[15,7,16,7],[15,2,16,2],[13,4,14,4],[5,5,6,5],[5,6,6,6],[5,7,6,7],[9,6,10,6],[9,7,10,7],[11,7,12,7],[11,6,12,6],[0,3,0,12],[0,0,0,2],[3,4,4,4],[3,5,4,5],[3,6,4,6],[5,0,6,0],[5,4,6,4],[5,2,6,2],[5,1,6,1],[7,7,8,7],[7,0,8,0],[7,1,8,1],[7,2,8,2],[7,4,8,4],[7,5,8,5],[7,6,8,6],[9,0,10,0],[9,1,10,1],[9,2,10,2],[9,4,10,4],[9,5,10,5],[11,1,12,1],[11,2,12,2],[11,4,12,4],[11,5,12,5],[13,0,14,0],[11,0,12,0],[17,1,18,1],[15,1,16,1],[13,1,14,1],[13,6,14,6],[15,6,16,6],[15,4,16,4],[13,5,14,5]]}
[{"$f":"\"Expedition # \" & Expedition","v":"Expedition # 608-A"},null,null,"Philmont Trek Duty Roster",null,null,null,null,null,null,null,null,null,{"$f":"Unit","v":"Troop 123"}]
[{"$f":"\"Itinerary # \" & itineraryNumber","v":"Itinerary # 12-1"},null,null,null,null,null,null,null,null,null,null,null,null,"Cook Dinner"]
["Trek Day #","Day","Date","Campsite\n     Food Pickup","Sh","Com","T.P.","Dry","Water","Stoves/Fuel","Meal Cleanup","Site Setup","Bear Bags"]
[2,{"$f":"Roster!H2","v":"Sun"},{"$f":"Roster!I2","v":"2024-06-09"},{"$f":"Roster!J2","v":"Toothache Springs"},{"$f":"UPPER(VLOOKUP($D4,campInfo,3))","v":""},{"$f":"UPPER(VLOOKUP($D4,campInfo,4))","v":""},{"$f":"UPPER(VLOOKUP($D4,campInfo,5))","v":""},{"$f":"UPPER(VLOOKUP($D4,campInfo,7))","v":""},{"$f":"IF(INDEX(assignments,ROW($I4)-ROW(I$3),COLUMN(I4)-COLUMN($H4))<1,\"\",INDEX(FirstNames,INDEX(assignments,ROW($I4)-ROW(I$3),COLUMN(I4)-COLUMN($H4)),1))","v":"Fred"},"Davey","Sam","George","Clem","George W."]
[null,null,null,{"$f":"INDEX(foodPickups,numericItinerary(itineraryNumber),A$4-1)","v":"Camping HQ"},null,null,null,null,{"$f":"IF(INDEX(assignments,ROW($I5)-ROW(I$3),COLUMN(I5)-COLUMN($H5))<1,\"\",INDEX(FirstNames,INDEX(assignments,ROW($I5)-ROW(I$3),COLUMN(I5)-COLUMN($H5)),1))","v":"Abe"},"Ike","John","Bill","Waite","George"]
[3,{"$f":"Roster!H4","v":"Mon"},{"$f":"Roster!I4","v":"2024-06-10"},{"$f":"Roster!J4","v":"URRACA"},{"$f":"UPPER(VLOOKUP($D6,campInfo,3))","v":""},{"$f":"UPPER(VLOOKUP($D6,campInfo,4))","v":""},{"$f":"UPPER(VLOOKUP($D6,campInfo,5))","v":""},{"$f":"UPPER(VLOOKUP($D6,campInfo,7))","v":""},"Davey","Sam","George","Clem","George W.","Abe"]
[null,null,null,{"$f":"IF(INDEX(foodPickups,numericItinerary(itineraryNumber),A$6-1)=\"\",\"\",INDEX(foodPickups,numericItinerary(itineraryNumber),A$6-1))","v":""},null,null,null,null,"Ike","John","Bill","Waite","George","Fred"]
[4,{"$f":"Roster!H6","v":"Tue"},{"$f":"Roster!I6","v":"2024-06-11"},{"$f":"Roster!J6","v":"Stockade Ridge"},{"$f":"UPPER(VLOOKUP($D8,campInfo,3))","v":""},{"$f":"UPPER(VLOOKUP($D8,campInfo,4))","v":""},{"$f":"UPPER(VLOOKUP($D8,campInfo,5))","v":""},{"$f":"UPPER(VLOOKUP($D8,campInfo,7))","v":"Y"},"Sam","George","Clem","George W.","Abe","Ike"]
[null,null,null,{"$f":"IF(INDEX(foodPickups,numericItinerary(itineraryNumber),A$8-1)=\"\",\"\",INDEX(foodPickups,numericItinerary(itineraryNumber),A$8-1))","v":""},null,null,null,null,"John","Bill","Waite","George","Fred","Davey"]
[5,{"$f":"Roster!H8","v":"Wed"},{"$f":"Roster!I8","v":"2024-06-12"},{"$f":"Roster!J8","v":"MINERS PARK"},{"$f":"UPPER(VLOOKUP($D10,campInfo,3))","v":"Y"},{"$f":"UPPER(VLOOKUP($D10,campInfo,4))","v":"Y"},{"$f":"UPPER(VLOOKUP($D10,campInfo,5))","v":""},{"$f":"UPPER(VLOOKUP($D10,campInfo,7))","v":""},"George","Clem","George W.","Abe","Ike","John"]
[null,null,null,{"$f":"IF(INDEX(foodPickups,numericItinerary(itineraryNumber),A$10-1)=\"\",\"\",INDEX(foodPickups,numericItinerary(itineraryNumber),A$10-1))","v":"Miners Park"},null,null,null,null,"Bill","Waite","George","Fred","Davey","Sam"]
[6,{"$f":"Roster!H10","v":"Thu"},{"$f":"Roster!I10","v":"2024-06-13"},{"$f":"Roster!J10","v":"BLACK MOUNTAIN"},{"$f":"UPPER(VLOOKUP($D12,campInfo,3))","v":""},{"$f":"UPPER(VLOOKUP($D12,campInfo,4))","v":""},{"$f":"UPPER(VLOOKUP($D12,campInfo,5))","v":""},{"$f":"UPPER(VLOOKUP($D12,campInfo,7))","v":""},"Clem","George W.","Abe","Ike","John","Bill"]
[null,null,null,{"$f":"IF(INDEX(foodPickups,numericItinerary(itineraryNumber),A$12-1)=\"\",\"\",INDEX(foodPickups,numericItinerary(itineraryNumber),A$12-1))","v":""},null,null,null,null,"Waite","George","Fred","Davey","Sam","George"]
[7,{"$f":"Roster!H6","v":"Tue"},{"$f":"Roster!I6","v":"2024-06-11"},{"$f":"Roster!J6","v":"Stockade Ridge"},{"$f":"UPPER(VLOOKUP($D14,campInfo,3))","v":""},{"$f":"UPPER(VLOOKUP($D14,campInfo,4))","v":""},{"$f":"UPPER(VLOOKUP($D14,campInfo,5))","v":""},{"$f":"UPPER(VLOOKUP($D14,campInfo,7))","v":"Y"},"George W.","Abe","Ike","John","Bill","Waite"]
[null,null,null,{"$f":"IF(INDEX(foodPickups,numericItinerary(itineraryNumber),A$14-1)=\"\",\"\",INDEX(foodPickups,numericItinerary(itineraryNumber),A$14-1))","v":""},null,null,null,null,"George","Fred","Davey","Sam","George","Clem"]
[8,{"$f":"Roster!H14","v":"Sat"},{"$f":"Roster!I14","v":"2024-06-15"},{"$f":"Roster!J14","v":"Porcupine"},{"$f":"UPPER(VLOOKUP($D16,campInfo,3))","v":""},{"$f":"UPPER(VLOOKUP($D16,campInfo,4))","v":""},{"$f":"UPPER(VLOOKUP($D16,campInfo,5))","v":""},{"$f":"UPPER(VLOOKUP($D16,campInfo,7))","v":""},"Abe","Ike","John","Bill","Waite","George"]
[null,null,null,{"$f":"IF(INDEX(foodPickups,numericItinerary(itineraryNumber),A$16-1)=\"\",\"\",INDEX(foodPickups,numericItinerary(itineraryNumber),A$16-1))","v":"Phillips Junction"},null,null,null,null,"Fred","Davey","Sam","George","Clem","John"]
[9,{"$f":"Roster!H16","v":"Sun"},{"$f":"Roster!I16","v":"2024-06-16"},{"$f":"Roster!J16","v":"Divide"},{"$f":"UPPER(VLOOKUP($D18,campInfo,3))","v":""},{"$f":"UPPER(VLOOKUP($D18,campInfo,4))","v":""},{"$f":"UPPER(VLOOKUP($D18,campInfo,5))","v":""},{"$f":"UPPER(VLOOKUP($D18,campInfo,7))","v":"Y"},"Ike","John","Bill","Waite","George","Fred"]
[null,null,null,{"$f":"IF(INDEX(foodPickups,numericItinerary(itineraryNumber),A$18-1)=\"\",\"\",INDEX(foodPickups,numericItinerary(itineraryNumber),A$18-1))","v":""},null,null,null,null,"Davey","Sam","George","Clem","George W.","Abe"]
[10,{"$f":"Roster!H18","v":"Mon"},{"$f":"Roster!I18","v":"2024-06-17"},{"$f":"Roster!J18","v":"CLEAR CREEK"},{"$f":"UPPER(VLOOKUP($D20,campInfo,3))","v":""},{"$f":"UPPER(VLOOKUP($D20,campInfo,4))","v":""},{"$f":"UPPER(VLOOKUP($D20,campInfo,5))","v":""},{"$f":"UPPER(VLOOKUP($D20,campInfo,7))","v":""},"John","Bill","Waite","George","Fred","Davey"]
[null,null,null,{"$f":"IF(INDEX(foodPickups,numericItinerary(itineraryNumber),A$20-1)=\"\",\"\",INDEX(foodPickups,numericItinerary(itineraryNumber),A$20-1))","v":""},null,null,null,null,"Sam","George","Clem","George W.","Abe","Ike"]
[11,{"$f":"Roster!H20","v":"Tue"},{"$f":"Roster!I20","v":"2024-06-18"},{"$f":"Roster!J20","v":"Tolby Headwaters"},{"$f":"UPPER(VLOOKUP($D22,campInfo,3))","v":""},{"$f":"UPPER(VLOOKUP($D22,campInfo,4))","v":""},{"$f":"UPPER(VLOOKUP($D22,campInfo,5))","v":""},{"$f":"UPPER(VLOOKUP($D22,campInfo,7))","v":""},"Bill","Waite","George","Fred","Davey","Sam"]
[null,null,null,{"$f":"IF(INDEX(foodPickups,numericItinerary(itineraryNumber),A$22-1)=\"\",\"\",INDEX(foodPickups,numericItinerary(itineraryNumber),A$22-1))","v":""},null,null,null,null,"George","Clem","George W.","Abe","Ike","George W."]

{"sheet":"Calculator","index":3,"n_rows":23,"n_cols":84,"rows_kept":23,"cut":false,"hidden":true,"merged":[[18,6,18,7],[1,8,2,8],[1,0,1,5],[17,6,17,7]]}
[null,null,null,null,null,null,null,null,null,{"$f":"A3","v":"Water"},null,null,null,null,null,null,null,null,null,null,null,{"$f":"B3","v":"Stoves Fuel"},null,null,null,null,null,null,null,null,null,null,null,{"$f":"C3","v":"Meal Cleanup"},null,null,null,null,null,null,null,null,null,null,null,{"$f":"D3","v":"Site Setup"},null,null,null,null,null,null,null,null,null,null,null,{"$f":"E3","v":"Bear Bags"},null,null,null,null,null,null,null,null,null,null,null,{"$f":"F3","v":"Cook Dinner"}]
["Participant's assigned to jobs by day (from Roster):",null,null,null,null,null,"Assignments:",null,"Total Jobs",{"$f":"$G$4","v":1},{"$f":"$G$5","v":2},{"$f":"$G$6","v":3},{"$f":"$G$7","v":4},{"$f":"$G$8","v":5},{"$f":"$G$9","v":6},{"$f":"$G$10","v":7},{"$f":"$G$11","v":8},{"$f":"$G$12","v":9},{"$f":"$G$13","v":10},{"$f":"$G$14","v":11},{"$f":"$G$15","v":12},{"$f":"$G$4","v":1},{"$f":"$G$5","v":2},{"$f":"$G$6","v":3},{"$f":"$G$7","v":4},{"$f":"$G$8","v":5},{"$f":"$G$9","v":6},{"$f":"$G$10","v":7},{"$f":"$G$11","v":8},{"$f":"$G$12","v":9},{"$f":"$G$13","v":10},{"$f":"$G$14","v":11},{"$f":"$G$15","v":12},{"$f":"$G$4","v":1},{"$f":"$G$5","v":2},{"$f":"$G$6","v":3},{"$f":"$G$7","v":4},{"$f":"$G$8","v":5},{"$f":"$G$9","v":6},{"$f":"$G$10","v":7},{"$f":"$G$11","v":8},{"$f":"$G$12","v":9},{"$f":"$G$13","v":10},{"$f":"$G$14","v":11},{"$f":"$G$15","v":12},{"$f":"$G$4","v":1},{"$f":"$G$5","v":2},{"$f":"$G$6","v":3},{"$f":"$G$7","v":4},{"$f":"$G$8","v":5},{"$f":"$G$9","v":6},{"$f":"$G$10","v":7},{"$f":"$G$11","v":8},{"$f":"$G$12","v":9},{"$f":"$G$13","v":10},{"$f":"$G$14","v":11},{"$f":"$G$15","v":12},{"$f":"$G$4","v":1},{"$f":"$G$5","v":2},{"$f":"$G$6","v":3},{"$f":"$G$7","v":4},{"$f":"$G$8","v":5},{"$f":"$G$9","v":6},{"$f":"$G$10","v":7},{"$f":"$G$11","v":8},{"$f":"$G$12","v":9},{"$f":"$G$13","v":10},{"$f":"$G$14","v":11},{"$f":"$G$15","v":12},{"$f":"$G$4","v":1},{"$f":"$G$5","v":2},{"$f":"$G$6","v":3},{"$f":"$G$7","v":4},{"$f":"$G$8","v":5},{"$f":"$G$9","v":6},{"$f":"$G$10","v":7},{"$f":"$G$11","v":8},{"$f":"$G$12","v":9},{"$f":"$G$13","v":10},{"$f":"$G$14","v":11},{"$f":"$G$15","v":12}]
[{"$f":"Roster!K1","v":"Water"},{"$f":"Roster!L1","v":"Stoves Fuel"},{"$f":"Roster!M1","v":"Meal Cleanup"},{"$f":"Roster!N1","v":"Site Setup"},{"$f":"Roster!O1","v":"Bear Bags"},{"$f":"Roster!P1","v":"Cook Dinner"},"Person #","Name",null,{"$f":"$H$4","v":"Fred"},{"$f":"$H$5","v":"Davey"},{"$f":"$H$6","v":"Sam"},{"$f":"$H$7","v":"George"},{"$f":"$H$8","v":"Clem"},{"$f":"$H$9","v":"George W."},{"$f":"$H$10","v":"Abe"},{"$f":"$H$11","v":"Ike"},{"$f":"$H$12","v":"John"},{"$f":"$H$13","v":"Bill"},{"$f":"$H$14","v":"Waite"},{"$f":"$H$15","v":"George"},{"$f":"$H$4","v":"Fred"},{"$f":"$H$5","v":"Davey"},{"$f":"$H$6","v":"Sam"},{"$f":"$H$7","v":"George"},{"$f":"$H$8","v":"Clem"},{"$f":"$H$9","v":"George W."},{"$f":"$H$10","v":"Abe"},{"$f":"$H$11","v":"Ike"},{"$f":"$H$12","v":"John"},{"$f":"$H$13","v":"Bill"},{"$f":"$H$14","v":"Waite"},{"$f":"$H$15","v":"George"},{"$f":"$H$4","v":"Fred"},{"$f":"$H$5","v":"Davey"},{"$f":"$H$6","v":"Sam"},{"$f":"$H$7","v":"George"},{"$f":"$H$8","v":"Clem"},{"$f":"$H$9","v":"George W."},{"$f":"$H$10","v":"Abe"},{"$f":"$H$11","v":"Ike"},{"$f":"$H$12","v":"John"},{"$f":"$H$13","v":"Bill"},{"$f":"$H$14","v":"Waite"},{"$f":"$H$15","v":"George"},{"$f":"$H$4","v":"Fred"},{"$f":"$H$5","v":"Davey"},{"$f":"$H$6","v":"Sam"},{"$f":"$H$7","v":"George"},{"$f":"$H$8","v":"Clem"},{"$f":"$H$9","v":"George W."},{"$f":"$H$10","v":"Abe"},{"$f":"$H$11","v":"Ike"},{"$f":"$H$12","v":"John"},{"$f":"$H$13","v":"Bill"},{"$f":"$H$14","v":"Waite"},{"$f":"$H$15","v":"George"},{"$f":"$H$4","v":"Fred"},{"$f":"$H$5","v":"Davey"},{"$f":"$H$6","v":"Sam"},{"$f":"$H$7","v":"George"},{"$f":"$H$8","v":"Clem"},{"$f":"$H$9","v":"George W."},{"$f":"$H$10","v":"Abe"},{"$f":"$H$11","v":"Ike"},{"$f":"$H$12","v":"John"},{"$f":"$H$13","v":"Bill"},{"$f":"$H$14","v":"Waite"},{"$f":"$H$15","v":"George"},{"$f":"$H$4","v":"Fred"},{"$f":"$H$5","v":"Davey"},{"$f":"$H$6","v":"Sam"},{"$f":"$H$7","v":"George"},{"$f":"$H$8","v":"Clem"},{"$f":"$H$9","v":"George W."},{"$f":"$H$10","v":"Abe"},{"$f":"$H$11","v":"Ike"},{"$f":"$H$12","v":"John"},{"$f":"$H$13","v":"Bill"},{"$f":"$H$14","v":"Waite"},{"$f":"$H$15","v":"George"},null,"Week Days"]
[{"$f":"Roster!K2","v":1},{"$f":"Roster!L2","v":2},{"$f":"Roster!M2","v":3},{"$f":"Roster!N2","v":4},{"$f":"Roster!O2","v":5},{"$f":"Roster!P2","v":6},{"$f":"Roster!A2","v":1},{"$f":"IF(ISBLANK(Roster!D2),\"\",Roster!D2)","v":"Fred"},{"$f":"IF(H4=\"\",\"\",INDEX(Water,18,$G4)+INDEX(Stoves_Fuel,18,$G4)+INDEX(Meal_Cleanup,18,$G4)+INDEX(Site_Setup,18,$G4)+INDEX(Bear_Bags,18,$G4)+INDEX(Cook_Dinner,18,$G4))","v":7},{"$f":"IF(Roster!$K$2=J$2,1,0)","v":1},{"$f":"IF(Roster!$K$2=K$2,1,0)","v":0},{"$f":"IF(Roster!$K$2=L$2,1,0)","v":0},{"$f":"IF(Roster!$K$2=M$2,1,0)","v":0},{"$f":"IF(Roster!$K$2=N$2,1,0)","v":0},{"$f":"IF(Roster!$K$2=O$2,1,0)","v":0},{"$f":"IF(Roster!$K$2=P$2,1,0)","v":0},{"$f":"IF(Roster!$K$2=Q$2,1,0)","v":0},{"$f":"IF(Roster!$K$2=R$2,1,0)","v":0},{"$f":"IF(Roster!$K$2=S$2,1,0)","v":0},{"$f":"IF(Roster!$K$2=T$2,1,0)","v":0},{"$f":"IF(Roster!$K$2=U$2,1,0)","v":0},{"$f":"IF(Roster!$L$2=V$2,1,0)","v":0},{"$f":"IF(Roster!$L$2=W$2,1,0)","v":1},{"$f":"IF(Roster!$L$2=X$2,1,0)","v":0},{"$f":"IF(Roster!$L$2=Y$2,1,0)","v":0},{"$f":"IF(Roster!$L$2=Z$2,1,0)","v":0},{"$f":"IF(Roster!$L$2=AA$2,1,0)","v":0},{"$f":"IF(Roster!$L$2=AB$2,1,0)","v":0},{"$f":"IF(Roster!$L$2=AC$2,1,0)","v":0},{"$f":"IF(Roster!$L$2=AD$2,1,0)","v":0},{"$f":"IF(Roster!$L$2=AE$2,1,0)","v":0},{"$f":"IF(Roster!$L$2=AF$2,1,0)","v":0},{"$f":"IF(Roster!$L$2=AG$2,1,0)","v":0},{"$f":"IF(Roster!$M$2=AH$2,1,0)","v":0},{"$f":"IF(Roster!$M$2=AI$2,1,0)","v":0},{"$f":"IF(Roster!$M$2=AJ$2,1,0)","v":1},{"$f":"IF(Roster!$M$2=AK$2,1,0)","v":0},{"$f":"IF(Roster!$M$2=AL$2,1,0)","v":0},{"$f":"IF(Roster!$M$2=AM$2,1,0)","v":0},{"$f":"IF(Roster!$M$2=AN$2,1,0)","v":0},{"$f":"IF(Roster!$M$2=AO$2,1,0)","v":0},{"$f":"IF(Roster!$M$2=AP$2,1,0)","v":0},{"$f":"IF(Roster!$M$2=AQ$2,1,0)","v":0},{"$f":"IF(Roster!$M$2=AR$2,1,0)","v":0},{"$f":"IF(Roster!$M$2=AS$2,1,0)","v":0},{"$f":"IF(Roster!$N$2=AT$2,1,0)","v":0},{"$f":"IF(Roster!$N$2=AU$2,1,0)","v":0},{"$f":"IF(Roster!$N$2=AV$2,1,0)","v":0},{"$f":"IF(Roster!$N$2=AW$2,1,0)","v":1},{"$f":"IF(Roster!$N$2=AX$2,1,0)","v":0},{"$f":"IF(Roster!$N$2=AY$2,1,0)","v":0},{"$f":"IF(Roster!$N$2=AZ$2,1,0)","v":0},{"$f":"IF(Roster!$N$2=BA$2,1,0)","v":0},{"$f":"IF(Roster!$N$2=BB$2,1,0)","v":0},{"$f":"IF(Roster!$N$2=BC$2,1,0)","v":0},{"$f":"IF(Roster!$N$2=BD$2,1,0)","v":0},{"$f":"IF(Roster!$N$2=BE$2,1,0)","v":0},{"$f":"IF(Roster!$O$2=BF$2,1,0)","v":0},{"$f":"IF(Roster!$O$2=BG$2,1,0)","v":0},{"$f":"IF(Roster!$O$2=BH$2,1,0)","v":0},{"$f":"IF(Roster!$O$2=BI$2,1,0)","v":0},{"$f":"IF(Roster!$O$2=BJ$2,1,0)","v":1},{"$f":"IF(Roster!$O$2=BK$2,1,0)","v":0},{"$f":"IF(Roster!$O$2=BL$2,1,0)","v":0},{"$f":"IF(Roster!$O$2=BM$2,1,0)","v":0},{"$f":"IF(Roster!$O$2=BN$2,1,0)","v":0},{"$f":"IF(Roster!$O$2=BO$2,1,0)","v":0},{"$f":"IF(Roster!$O$2=BP$2,1,0)","v":0},{"$f":"IF(Roster!$O$2=BQ$2,1,0)","v":0},{"$f":"IF(Roster!$P$2=BR$2,1,0)","v":0},{"$f":"IF(Roster!$P$2=BS$2,1,0)","v":0},{"$f":"IF(Roster!$P$2=BT$2,1,0)","v":0},{"$f":"IF(Roster!$P$2=BU$2,1,0)","v":0},{"$f":"IF(Roster!$P$2=BV$2,1,0)","v":0},{"$f":"IF(Roster!$P$2=BW$2,1,0)","v":1},{"$f":"IF(Roster!$P$2=BX$2,1,0)","v":0},{"$f":"IF(Roster!$P$2=BY$2,1,0)","v":0},{"$f":"IF(Roster!$P$2=BZ$2,1,0)","v":0},{"$f":"IF(Roster!$P$2=CA$2,1,0)","v":0},{"$f":"IF(Roster!$P$2=CB$2,1,0)","v":0},{"$f":"IF(Roster!$P$2=CC$2,1,0)","v":0},null,"Sunday","Sun"]
[{"$f":"Roster!K3","v":7},{"$f":"Roster!L3","v":8},{"$f":"Roster!M3","v":9},{"$f":"Roster!N3","v":10},{"$f":"Roster!O3","v":11},{"$f":"Roster!P3","v":12},{"$f":"Roster!A3","v":2},{"$f":"IF(ISBLANK(Roster!D3),\"\",Roster!D3)","v":"Davey"},{"$f":"IF(H5=\"\",\"\",INDEX(Water,18,$G5)+INDEX(Stoves_Fuel,18,$G5)+INDEX(Meal_Cleanup,18,$G5)+INDEX(Site_Setup,18,$G5)+INDEX(Bear_Bags,18,$G5)+INDEX(Cook_Dinner,18,$G5))","v":7},{"$f":"IF(Roster!$K$3=J$2,1,0)","v":0},{"$f":"IF(Roster!$K$3=K$2,1,0)","v":0},{"$f":"IF(Roster!$K$3=L$2,1,0)","v":0},{"$f":"IF(Roster!$K$3=M$2,1,0)","v":0},{"$f":"IF(Roster!$K$3=N$2,1,0)","v":0},{"$f":"IF(Roster!$K$3=O$2,1,0)","v":0},{"$f":"IF(Roster!$K$3=P$2,1,0)","v":1},{"$f":"IF(Roster!$K$3=Q$2,1,0)","v":0},{"$f":"IF(Roster!$K$3=R$2,1,0)","v":0},{"$f":"IF(Roster!$K$3=S$2,1,0)","v":0},{"$f":"IF(Roster!$K$3=T$2,1,0)","v":0},{"$f":"IF(Roster!$K$3=U$2,1,0)","v":0},{"$f":"IF(Roster!$L$3=V$2,1,0)","v":0},{"$f":"IF(Roster!$L$3=W$2,1,0)","v":0},{"$f":"IF(Roster!$L$3=X$2,1,0)","v":0},{"$f":"IF(Roster!$L$3=Y$2,1,0)","v":0},{"$f":"IF(Roster!$L$3=Z$2,1,0)","v":0},{"$f":"IF(Roster!$L$3=AA$2,1,0)","v":0},{"$f":"IF(Roster!$L$3=AB$2,1,0)","v":0},{"$f":"IF(Roster!$L$3=AC$2,1,0)","v":1},{"$f":"IF(Roster!$L$3=AD$2,1,0)","v":0},{"$f":"IF(Roster!$L$3=AE$2,1,0)","v":0},{"$f":"IF(Roster!$L$3=AF$2,1,0)","v":0},{"$f":"IF(Roster!$L$3=AG$2,1,0)","v":0},{"$f":"IF(Roster!$M$3=AH$2,1,0)","v":0},{"$f":"IF(Roster!$M$3=AI$2,1,0)","v":0},{"$f":"IF(Roster!$M$3=AJ$2,1,0)","v":0},{"$f":"IF(Roster!$M$3=AK$2,1,0)","v":0},{"$f":"IF(Roster!$M$3=AL$2,1,0)","v":0},{"$f":"IF(Roster!$M$3=AM$2,1,0)","v":0},{"$f":"IF(Roster!$M$3=AN$2,1,0)","v":0},{"$f":"IF(Roster!$M$3=AO$2,1,0)","v":0},{"$f":"IF(Roster!$M$3=AP$2,1,0)","v":1},{"$f":"IF(Roster!$M$3=AQ$2,1,0)","v":0},{"$f":"IF(Roster!$M$3=AR$2,1,0)","v":0},{"$f":"IF(Roster!$M$3=AS$2,1,0)","v":0},{"$f":"IF(Roster!$N$3=AT$2,1,0)","v":0},{"$f":"IF(Roster!$N$3=AU$2,1,0)","v":0},{"$f":"IF(Roster!$N$3=AV$2,1,0)","v":0},{"$f":"IF(Roster!$N$3=AW$2,1,0)","v":0},{"$f":"IF(Roster!$N$3=AX$2,1,0)","v":0},{"$f":"IF(Roster!$N$3=AY$2,1,0)","v":0},{"$f":"IF(Roster!$N$3=AZ$2,1,0)","v":0},{"$f":"IF(Roster!$N$3=BA$2,1,0)","v":0},{"$f":"IF(Roster!$N$3=BB$2,1,0)","v":0},{"$f":"IF(Roster!$N$3=BC$2,1,0)","v":1},{"$f":"IF(Roster!$N$3=BD$2,1,0)","v":0},{"$f":"IF(Roster!$N$3=BE$2,1,0)","v":0},{"$f":"IF(Roster!$O$3=BF$2,1,0)","v":0},{"$f":"IF(Roster!$O$3=BG$2,1,0)","v":0},{"$f":"IF(Roster!$O$3=BH$2,1,0)","v":0},{"$f":"IF(Roster!$O$3=BI$2,1,0)","v":0},{"$f":"IF(Roster!$O$3=BJ$2,1,0)","v":0},{"$f":"IF(Roster!$O$3=BK$2,1,0)","v":0},{"$f":"IF(Roster!$O$3=BL$2,1,0)","v":0},{"$f":"IF(Roster!$O$3=BM$2,1,0)","v":0},{"$f":"IF(Roster!$O$3=BN$2,1,0)","v":0},{"$f":"IF(Roster!$O$3=BO$2,1,0)","v":0},{"$f":"IF(Roster!$O$3=BP$2,1,0)","v":1},{"$f":"IF(Roster!$O$3=BQ$2,1,0)","v":0},{"$f":"IF(Roster!$P$3=BR$2,1,0)","v":0},{"$f":"IF(Roster!$P$3=BS$2,1,0)","v":0},{"$f":"IF(Roster!$P$3=BT$2,1,0)","v":0},{"$f":"IF(Roster!$P$3=BU$2,1,0)","v":0},{"$f":"IF(Roster!$P$3=BV$2,1,0)","v":0},{"$f":"IF(Roster!$P$3=BW$2,1,0)","v":0},{"$f":"IF(Roster!$P$3=BX$2,1,0)","v":0},{"$f":"IF(Roster!$P$3=BY$2,1,0)","v":0},{"$f":"IF(Roster!$P$3=BZ$2,1,0)","v":0},{"$f":"IF(Roster!$P$3=CA$2,1,0)","v":0},{"$f":"IF(Roster!$P$3=CB$2,1,0)","v":0},{"$f":"IF(Roster!$P$3=CC$2,1,0)","v":1},null,"Monday","Mon"]
[{"$f":"Roster!K4","v":2},{"$f":"Roster!L4","v":3},{"$f":"Roster!M4","v":4},{"$f":"Roster!N4","v":5},{"$f":"Roster!O4","v":6},{"$f":"Roster!P4","v":7},{"$f":"Roster!A4","v":3},{"$f":"IF(ISBLANK(Roster!D4),\"\",Roster!D4)","v":"Sam"},{"$f":"IF(H6=\"\",\"\",INDEX(Water,18,$G6)+INDEX(Stoves_Fuel,18,$G6)+INDEX(Meal_Cleanup,18,$G6)+INDEX(Site_Setup,18,$G6)+INDEX(Bear_Bags,18,$G6)+INDEX(Cook_Dinner,18,$G6))","v":7},{"$f":"IF(Roster!$K$4=J$2,1,0)","v":0},{"$f":"IF(Roster!$K$4=K$2,1,0)","v":1},{"$f":"IF(Roster!$K$4=L$2,1,0)","v":0},{"$f":"IF(Roster!$K$4=M$2,1,0)","v":0},{"$f":"IF(Roster!$K$4=N$2,1,0)","v":0},{"$f":"IF(Roster!$K$4=O$2,1,0)","v":0},{"$f":"IF(Roster!$K$4=P$2,1,0)","v":0},{"$f":"IF(Roster!$K$4=Q$2,1,0)","v":0},{"$f":"IF(Roster!$K$4=R$2,1,0)","v":0},{"$f":"IF(Roster!$K$4=S$2,1,0)","v":0},{"$f":"IF(Roster!$K$4=T$2,1,0)","v":0},{"$f":"IF(Roster!$K$4=U$2,1,0)","v":0},{"$f":"IF(Roster!$L$4=V$2,1,0)","v":0},{"$f":"IF(Roster!$L$4=W$2,1,0)","v":0},{"$f":"IF(Roster!$L$4=X$2,1,0)","v":1},{"$f":"IF(Roster!$L$4=Y$2,1,0)","v":0},{"$f":"IF(Roster!$L$4=Z$2,1,0)","v":0},{"$f":"IF(Roster!$L$4=AA$2,1,0)","v":0},{"$f":"IF(Roster!$L$4=AB$2,1,0)","v":0},{"$f":"IF(Roster!$L$4=AC$2,1,0)","v":0},{"$f":"IF(Roster!$L$4=AD$2,1,0)","v":0},{"$f":"IF(Roster!$L$4=AE$2,1,0)","v":0},{"$f":"IF(Roster!$L$4=AF$2,1,0)","v":0},{"$f":"IF(Roster!$L$4=AG$2,1,0)","v":0},{"$f":"IF(Roster!$M$4=AH$2,1,0)","v":0},{"$f":"IF(Roster!$M$4=AI$2,1,0)","v":0},{"$f":"IF(Roster!$M$4=AJ$2,1,0)","v":0},{"$f":"IF(Roster!$M$4=AK$2,1,0)","v":1},{"$f":"IF(Roster!$M$4=AL$2,1,0)","v":0},{"$f":"IF(Roster!$M$4=AM$2,1,0)","v":0},{"$f":"IF(Roster!$M$4=AN$2,1,0)","v":0},{"$f":"IF(Roster!$M$4=AO$2,1,0)","v":0},{"$f":"IF(Roster!$M$4=AP$2,1,0)","v":0},{"$f":"IF(Roster!$M$4=AQ$2,1,0)","v":0},{"$f":"IF(Roster!$M$4=AR$2,1,0)","v":0},{"$f":"IF(Roster!$M$4=AS$2,1,0)","v":0},{"$f":"IF(Roster!$N$4=AT$2,1,0)","v":0},{"$f":"IF(Roster!$N$4=AU$2,1,0)","v":0},{"$f":"IF(Roster!$N$4=AV$2,1,0)","v":0},{"$f":"IF(Roster!$N$4=AW$2,1,0)","v":0},{"$f":"IF(Roster!$N$4=AX$2,1,0)","v":1},{"$f":"IF(Roster!$N$4=AY$2,1,0)","v":0},{"$f":"IF(Roster!$N$4=AZ$2,1,0)","v":0},{"$f":"IF(Roster!$N$4=BA$2,1,0)","v":0},{"$f":"IF(Roster!$N$4=BB$2,1,0)","v":0},{"$f":"IF(Roster!$N$4=BC$2,1,0)","v":0},{"$f":"IF(Roster!$N$4=BD$2,1,0)","v":0},{"$f":"IF(Roster!$N$4=BE$2,1,0)","v":0},{"$f":"IF(Roster!$O$4=BF$2,1,0)","v":0},{"$f":"IF(Roster!$O$4=BG$2,1,0)","v":0},{"$f":"IF(Roster!$O$4=BH$2,1,0)","v":0},{"$f":"IF(Roster!$O$4=BI$2,1,0)","v":0},{"$f":"IF(Roster!$O$4=BJ$2,1,0)","v":0},{"$f":"IF(Roster!$O$4=BK$2,1,0)","v":1},{"$f":"IF(Roster!$O$4=BL$2,1,0)","v":0},{"$f":"IF(Roster!$O$4=BM$2,1,0)","v":0},{"$f":"IF(Roster!$O$4=BN$2,1,0)","v":0},{"$f":"IF(Roster!$O$4=BO$2,1,0)","v":0},{"$f":"IF(Roster!$O$4=BP$2,1,0)","v":0},{"$f":"IF(Roster!$O$4=BQ$2,1,0)","v":0},{"$f":"IF(Roster!$P$4=BR$2,1,0)","v":0},{"$f":"IF(Roster!$P$4=BS$2,1,0)","v":0},{"$f":"IF(Roster!$P$4=BT$2,1,0)","v":0},{"$f":"IF(Roster!$P$4=BU$2,1,0)","v":0},{"$f":"IF(Roster!$P$4=BV$2,1,0)","v":0},{"$f":"IF(Roster!$P$4=BW$2,1,0)","v":0},{"$f":"IF(Roster!$P$4=BX$2,1,0)","v":1},{"$f":"IF(Roster!$P$4=BY$2,1,0)","v":0},{"$f":"IF(Roster!$P$4=BZ$2,1,0)","v":0},{"$f":"IF(Roster!$P$4=CA$2,1,0)","v":0},{"$f":"IF(Roster!$P$4=CB$2,1,0)","v":0},{"$f":"IF(Roster!$P$4=CC$2,1,0)","v":0},null,"Tuesday","Tue"]
[{"$f":"Roster!K5","v":8},{"$f":"Roster!L5","v":9},{"$f":"Roster!M5","v":10},{"$f":"Roster!N5","v":11},{"$f":"Roster!O5","v":12},{"$f":"Roster!P5","v":1},{"$f":"Roster!A5","v":4},{"$f":"IF(ISBLANK(Roster!D5),\"\",Roster!D5)","v":"George"},{"$f":"IF(H7=\"\",\"\",INDEX(Water,18,$G7)+INDEX(Stoves_Fuel,18,$G7)+INDEX(Meal_Cleanup,18,$G7)+INDEX(Site_Setup,18,$G7)+INDEX(Bear_Bags,18,$G7)+INDEX(Cook_Dinner,18,$G7))","v":7},{"$f":"IF(Roster!$K$5=J$2,1,0)","v":0},{"$f":"IF(Roster!$K$5=K$2,1,0)","v":0},{"$f":"IF(Roster!$K$5=L$2,1,0)","v":0},{"$f":"IF(Roster!$K$5=M$2,1,0)","v":0},{"$f":"IF(Roster!$K$5=N$2,1,0)","v":0},{"$f":"IF(Roster!$K$5=O$2,1,0)","v":0},{"$f":"IF(Roster!$K$5=P$2,1,0)","v":0},{"$f":"IF(Roster!$K$5=Q$2,1,0)","v":1},{"$f":"IF(Roster!$K$5=R$2,1,0)","v":0},{"$f":"IF(Roster!$K$5=S$2,1,0)","v":0},{"$f":"IF(Roster!$K$5=T$2,1,0)","v":0},{"$f":"IF(Roster!$K$5=U$2,1,0)","v":0},{"$f":"IF(Roster!$L$5=V$2,1,0)","v":0},{"$f":"IF(Roster!$L$5=W$2,1,0)","v":0},{"$f":"IF(Roster!$L$5=X$2,1,0)","v":0},{"$f":"IF(Roster!$L$5=Y$2,1,0)","v":0},{"$f":"IF(Roster!$L$5=Z$2,1,0)","v":0},{"$f":"IF(Roster!$L$5=AA$2,1,0)","v":0},{"$f":"IF(Roster!$L$5=AB$2,1,0)","v":0},{"$f":"IF(Roster!$L$5=AC$2,1,0)","v":0},{"$f":"IF(Roster!$L$5=AD$2,1,0)","v":1},{"$f":"IF(Roster!$L$5=AE$2,1,0)","v":0},{"$f":"IF(Roster!$L$5=AF$2,1,0)","v":0},{"$f":"IF(Roster!$L$5=AG$2,1,0)","v":0},{"$f":"IF(Roster!$M$5=AH$2,1,0)","v":0},{"$f":"IF(Roster!$M$5=AI$2,1,0)","v":0},{"$f":"IF(Roster!$M$5=AJ$2,1,0)","v":0},{"$f":"IF(Roster!$M$5=AK$2,1,0)","v":0},{"$f":"IF(Roster!$M$5=AL$2,1,0)","v":0},{"$f":"IF(Roster!$M$5=AM$2,1,0)","v":0},{"$f":"IF(Roster!$M$5=AN$2,1,0)","v":0},{"$f":"IF(Roster!$M$5=AO$2,1,0)","v":0},{"$f":"IF(Roster!$M$5=AP$2,1,0)","v":0},{"$f":"IF(Roster!$M$5=AQ$2,1,0)","v":1},{"$f":"IF(Roster!$M$5=AR$2,1,0)","v":0},{"$f":"IF(Roster!$M$5=AS$2,1,0)","v":0},{"$f":"IF(Roster!$N$5=AT$2,1,0)","v":0},{"$f":"IF(Roster!$N$5=AU$2,1,0)","v":0},{"$f":"IF(Roster!$N$5=AV$2,1,0)","v":0},{"$f":"IF(Roster!$N$5=AW$2,1,0)","v":0},{"$f":"IF(Roster!$N$5=AX$2,1,0)","v":0},{"$f":"IF(Roster!$N$5=AY$2,1,0)","v":0},{"$f":"IF(Roster!$N$5=AZ$2,1,0)","v":0},{"$f":"IF(Roster!$N$5=BA$2,1,0)","v":0},{"$f":"IF(Roster!$N$5=BB$2,1,0)","v":0},{"$f":"IF(Roster!$N$5=BC$2,1,0)","v":0},{"$f":"IF(Roster!$N$5=BD$2,1,0)","v":1},{"$f":"IF(Roster!$N$5=BE$2,1,0)","v":0},{"$f":"IF(Roster!$O$5=BF$2,1,0)","v":0},{"$f":"IF(Roster!$O$5=BG$2,1,0)","v":0},{"$f":"IF(Roster!$O$5=BH$2,1,0)","v":0},{"$f":"IF(Roster!$O$5=BI$2,1,0)","v":0},{"$f":"IF(Roster!$O$5=BJ$2,1,0)","v":0},{"$f":"IF(Roster!$O$5=BK$2,1,0)","v":0},{"$f":"IF(Roster!$O$5=BL$2,1,0)","v":0},{"$f":"IF(Roster!$O$5=BM$2,1,0)","v":0},{"$f":"IF(Roster!$O$5=BN$2,1,0)","v":0},{"$f":"IF(Roster!$O$5=BO$2,1,0)","v":0},{"$f":"IF(Roster!$O$5=BP$2,1,0)","v":0},{"$f":"IF(Roster!$O$5=BQ$2,1,0)","v":1},{"$f":"IF(Roster!$P$5=BR$2,1,0)","v":1},{"$f":"IF(Roster!$P$5=BS$2,1,0)","v":0},{"$f":"IF(Roster!$P$5=BT$2,1,0)","v":0},{"$f":"IF(Roster!$P$5=BU$2,1,0)","v":0},{"$f":"IF(Roster!$P$5=BV$2,1,0)","v":0},{"$f":"IF(Roster!$P$5=BW$2,1,0)","v":0},{"$f":"IF(Roster!$P$5=BX$2,1,0)","v":0},{"$f":"IF(Roster!$P$5=BY$2,1,0)","v":0},{"$f":"IF(Roster!$P$5=BZ$2,1,0)","v":0},{"$f":"IF(Roster!$P$5=CA$2,1,0)","v":0},{"$f":"IF(Roster!$P$5=CB$2,1,0)","v":0},{"$f":"IF(Roster!$P$5=CC$2,1,0)","v":0},null,"Wednesday","Wed"]
[{"$f":"Roster!K6","v":3},{"$f":"Roster!L6","v":4},{"$f":"Roster!M6","v":5},{"$f":"Roster!N6","v":6},{"$f":"Roster!O6","v":7},{"$f":"Roster!P6","v":8},{"$f":"Roster!A6","v":5},{"$f":"IF(ISBLANK(Roster!D6),\"\",Roster!D6)","v":"Clem"},{"$f":"IF(H8=\"\",\"\",INDEX(Water,18,$G8)+INDEX(Stoves_Fuel,18,$G8)+INDEX(Meal_Cleanup,18,$G8)+INDEX(Site_Setup,18,$G8)+INDEX(Bear_Bags,18,$G8)+INDEX(Cook_Dinner,18,$G8))","v":7},{"$f":"IF(Roster!$K$6=J$2,1,0)","v":0},{"$f":"IF(Roster!$K$6=K$2,1,0)","v":0},{"$f":"IF(Roster!$K$6=L$2,1,0)","v":1},{"$f":"IF(Roster!$K$6=M$2,1,0)","v":0},{"$f":"IF(Roster!$K$6=N$2,1,0)","v":0},{"$f":"IF(Roster!$K$6=O$2,1,0)","v":0},{"$f":"IF(Roster!$K$6=P$2,1,0)","v":0},{"$f":"IF(Roster!$K$6=Q$2,1,0)","v":0},{"$f":"IF(Roster!$K$6=R$2,1,0)","v":0},{"$f":"IF(Roster!$K$6=S$2,1,0)","v":0},{"$f":"IF(Roster!$K$6=T$2,1,0)","v":0},{"$f":"IF(Roster!$K$6=U$2,1,0)","v":0},{"$f":"IF(Roster!$L$6=V$2,1,0)","v":0},{"$f":"IF(Roster!$L$6=W$2,1,0)","v":0},{"$f":"IF(Roster!$L$6=X$2,1,0)","v":0},{"$f":"IF(Roster!$L$6=Y$2,1,0)","v":1},{"$f":"IF(Roster!$L$6=Z$2,1,0)","v":0},{"$f":"IF(Roster!$L$6=AA$2,1,0)","v":0},{"$f":"IF(Roster!$L$6=AB$2,1,0)","v":0},{"$f":"IF(Roster!$L$6=AC$2,1,0)","v":0},{"$f":"IF(Roster!$L$6=AD$2,1,0)","v":0},{"$f":"IF(Roster!$L$6=AE$2,1,0)","v":0},{"$f":"IF(Roster!$L$6=AF$2,1,0)","v":0},{"$f":"IF(Roster!$L$6=AG$2,1,0)","v":0},{"$f":"IF(Roster!$M$6=AH$2,1,0)","v":0},{"$f":"IF(Roster!$M$6=AI$2,1,0)","v":0},{"$f":"IF(Roster!$M$6=AJ$2,1,0)","v":0},{"$f":"IF(Roster!$M$6=AK$2,1,0)","v":0},{"$f":"IF(Roster!$M$6=AL$2,1,0)","v":1},{"$f":"IF(Roster!$M$6=AM$2,1,0)","v":0},{"$f":"IF(Roster!$M$6=AN$2,1,0)","v":0},{"$f":"IF(Roster!$M$6=AO$2,1,0)","v":0},{"$f":"IF(Roster!$M$6=AP$2,1,0)","v":0},{"$f":"IF(Roster!$M$6=AQ$2,1,0)","v":0},{"$f":"IF(Roster!$M$6=AR$2,1,0)","v":0},{"$f":"IF(Roster!$M$6=AS$2,1,0)","v":0},{"$f":"IF(Roster!$N$6=AT$2,1,0)","v":0},{"$f":"IF(Roster!$N$6=AU$2,1,0)","v":0},{"$f":"IF(Roster!$N$6=AV$2,1,0)","v":0},{"$f":"IF(Roster!$N$6=AW$2,1,0)","v":0},{"$f":"IF(Roster!$N$6=AX$2,1,0)","v":0},{"$f":"IF(Roster!$N$6=AY$2,1,0)","v":1},{"$f":"IF(Roster!$N$6=AZ$2,1,0)","v":0},{"$f":"IF(Roster!$N$6=BA$2,1,0)","v":0},{"$f":"IF(Roster!$N$6=BB$2,1,0)","v":0},{"$f":"IF(Roster!$N$6=BC$2,1,0)","v":0},{"$f":"IF(Roster!$N$6=BD$2,1,0)","v":0},{"$f":"IF(Roster!$N$6=BE$2,1,0)","v":0},{"$f":"IF(Roster!$O$6=BF$2,1,0)","v":0},{"$f":"IF(Roster!$O$6=BG$2,1,0)","v":0},{"$f":"IF(Roster!$O$6=BH$2,1,0)","v":0},{"$f":"IF(Roster!$O$6=BI$2,1,0)","v":0},{"$f":"IF(Roster!$O$6=BJ$2,1,0)","v":0},{"$f":"IF(Roster!$O$6=BK$2,1,0)","v":0},{"$f":"IF(Roster!$O$6=BL$2,1,0)","v":1},{"$f":"IF(Roster!$O$6=BM$2,1,0)","v":0},{"$f":"IF(Roster!$O$6=BN$2,1,0)","v":0},{"$f":"IF(Roster!$O$6=BO$2,1,0)","v":0},{"$f":"IF(Roster!$O$6=BP$2,1,0)","v":0},{"$f":"IF(Roster!$O$6=BQ$2,1,0)","v":0},{"$f":"IF(Roster!$P$6=BR$2,1,0)","v":0},{"$f":"IF(Roster!$P$6=BS$2,1,0)","v":0},{"$f":"IF(Roster!$P$6=BT$2,1,0)","v":0},{"$f":"IF(Roster!$P$6=BU$2,1,0)","v":0},{"$f":"IF(Roster!$P$6=BV$2,1,0)","v":0},{"$f":"IF(Roster!$P$6=BW$2,1,0)","v":0},{"$f":"IF(Roster!$P$6=BX$2,1,0)","v":0},{"$f":"IF(Roster!$P$6=BY$2,1,0)","v":1},{"$f":"IF(Roster!$P$6=BZ$2,1,0)","v":0},{"$f":"IF(Roster!$P$6=CA$2,1,0)","v":0},{"$f":"IF(Roster!$P$6=CB$2,1,0)","v":0},{"$f":"IF(Roster!$P$6=CC$2,1,0)","v":0},null,"Thursday","Thu"]
[{"$f":"Roster!K7","v":9},{"$f":"Roster!L7","v":10},{"$f":"Roster!M7","v":11},{"$f":"Roster!N7","v":12},{"$f":"Roster!O7","v":1},{"$f":"Roster!P7","v":2},{"$f":"Roster!A7","v":6},{"$f":"IF(ISBLANK(Roster!D7),\"\",Roster!D7)","v":"George W."},{"$f":"IF(H9=\"\",\"\",INDEX(Water,18,$G9)+INDEX(Stoves_Fuel,18,$G9)+INDEX(Meal_Cleanup,18,$G9)+INDEX(Site_Setup,18,$G9)+INDEX(Bear_Bags,18,$G9)+INDEX(Cook_Dinner,18,$G9))","v":7},{"$f":"IF(Roster!$K$7=J$2,1,0)","v":0},{"$f":"IF(Roster!$K$7=K$2,1,0)","v":0},{"$f":"IF(Roster!$K$7=L$2,1,0)","v":0},{"$f":"IF(Roster!$K$7=M$2,1,0)","v":0},{"$f":"IF(Roster!$K$7=N$2,1,0)","v":0},{"$f":"IF(Roster!$K$7=O$2,1,0)","v":0},{"$f":"IF(Roster!$K$7=P$2,1,0)","v":0},{"$f":"IF(Roster!$K$7=Q$2,1,0)","v":0},{"$f":"IF(Roster!$K$7=R$2,1,0)","v":1},{"$f":"IF(Roster!$K$7=S$2,1,0)","v":0},{"$f":"IF(Roster!$K$7=T$2,1,0)","v":0},{"$f":"IF(Roster!$K$7=U$2,1,0)","v":0},{"$f":"IF(Roster!$L$7=V$2,1,0)","v":0},{"$f":"IF(Roster!$L$7=W$2,1,0)","v":0},{"$f":"IF(Roster!$L$7=X$2,1,0)","v":0},{"$f":"IF(Roster!$L$7=Y$2,1,0)","v":0},{"$f":"IF(Roster!$L$7=Z$2,1,0)","v":0},{"$f":"IF(Roster!$L$7=AA$2,1,0)","v":0},{"$f":"IF(Roster!$L$7=AB$2,1,0)","v":0},{"$f":"IF(Roster!$L$7=AC$2,1,0)","v":0},{"$f":"IF(Roster!$L$7=AD$2,1,0)","v":0},{"$f":"IF(Roster!$L$7=AE$2,1,0)","v":1},{"$f":"IF(Roster!$L$7=AF$2,1,0)","v":0},{"$f":"IF(Roster!$L$7=AG$2,1,0)","v":0},{"$f":"IF(Roster!$M$7=AH$2,1,0)","v":0},{"$f":"IF(Roster!$M$7=AI$2,1,0)","v":0},{"$f":"IF(Roster!$M$7=AJ$2,1,0)","v":0},{"$f":"IF(Roster!$M$7=AK$2,1,0)","v":0},{"$f":"IF(Roster!$M$7=AL$2,1,0)","v":0},{"$f":"IF(Roster!$M$7=AM$2,1,0)","v":0},{"$f":"IF(Roster!$M$7=AN$2,1,0)","v":0},{"$f":"IF(Roster!$M$7=AO$2,1,0)","v":0},{"$f":"IF(Roster!$M$7=AP$2,1,0)","v":0},{"$f":"IF(Roster!$M$7=AQ$2,1,0)","v":0},{"$f":"IF(Roster!$M$7=AR$2,1,0)","v":1},{"$f":"IF(Roster!$M$7=AS$2,1,0)","v":0},{"$f":"IF(Roster!$N$7=AT$2,1,0)","v":0},{"$f":"IF(Roster!$N$7=AU$2,1,0)","v":0},{"$f":"IF(Roster!$N$7=AV$2,1,0)","v":0},{"$f":"IF(Roster!$N$7=AW$2,1,0)","v":0},{"$f":"IF(Roster!$N$7=AX$2,1,0)","v":0},{"$f":"IF(Roster!$N$7=AY$2,1,0)","v":0},{"$f":"IF(Roster!$N$7=AZ$2,1,0)","v":0},{"$f":"IF(Roster!$N$7=BA$2,1,0)","v":0},{"$f":"IF(Roster!$N$7=BB$2,1,0)","v":0},{"$f":"IF(Roster!$N$7=BC$2,1,0)","v":0},{"$f":"IF(Roster!$N$7=BD$2,1,0)","v":0},{"$f":"IF(Roster!$N$7=BE$2,1,0)","v":1},{"$f":"IF(Roster!$O$7=BF$2,1,0)","v":1},{"$f":"IF(Roster!$O$7=BG$2,1,0)","v":0},{"$f":"IF(Roster!$O$7=BH$2,1,0)","v":0},{"$f":"IF(Roster!$O$7=BI$2,1,0)","v":0},{"$f":"IF(Roster!$O$7=BJ$2,1,0)","v":0},{"$f":"IF(Roster!$O$7=BK$2,1,0)","v":0},{"$f":"IF(Roster!$O$7=BL$2,1,0)","v":0},{"$f":"IF(Roster!$O$7=BM$2,1,0)","v":0},{"$f":"IF(Roster!$O$7=BN$2,1,0)","v":0},{"$f":"IF(Roster!$O$7=BO$2,1,0)","v":0},{"$f":"IF(Roster!$O$7=BP$2,1,0)","v":0},{"$f":"IF(Roster!$O$7=BQ$2,1,0)","v":0},{"$f":"IF(Roster!$P$7=BR$2,1,0)","v":0},{"$f":"IF(Roster!$P$7=BS$2,1,0)","v":1},{"$f":"IF(Roster!$P$7=BT$2,1,0)","v":0},{"$f":"IF(Roster!$P$7=BU$2,1,0)","v":0},{"$f":"IF(Roster!$P$7=BV$2,1,0)","v":0},{"$f":"IF(Roster!$P$7=BW$2,1,0)","v":0},{"$f":"IF(Roster!$P$7=BX$2,1,0)","v":0},{"$f":"IF(Roster!$P$7=BY$2,1,0)","v":0},{"$f":"IF(Roster!$P$7=BZ$2,1,0)","v":0},{"$f":"IF(Roster!$P$7=CA$2,1,0)","v":0},{"$f":"IF(Roster!$P$7=CB$2,1,0)","v":0},{"$f":"IF(Roster!$P$7=CC$2,1,0)","v":0},null,"Friday","Fri"]
[{"$f":"Roster!K8","v":4},{"$f":"Roster!L8","v":5},{"$f":"Roster!M8","v":6},{"$f":"Roster!N8","v":7},{"$f":"Roster!O8","v":8},{"$f":"Roster!P8","v":9},{"$f":"Roster!A8","v":7},{"$f":"IF(ISBLANK(Roster!D8),\"\",Roster!D8)","v":"Abe"},{"$f":"IF(H10=\"\",\"\",INDEX(Water,18,$G10)+INDEX(Stoves_Fuel,18,$G10)+INDEX(Meal_Cleanup,18,$G10)+INDEX(Site_Setup,18,$G10)+INDEX(Bear_Bags,18,$G10)+INDEX(Cook_Dinner,18,$G10))","v":7},{"$f":"IF(Roster!$K$14=J$2,1,0)","v":0},{"$f":"IF(Roster!$K$14=K$2,1,0)","v":0},{"$f":"IF(Roster!$K$14=L$2,1,0)","v":0},{"$f":"IF(Roster!$K$14=M$2,1,0)","v":0},{"$f":"IF(Roster!$K$14=N$2,1,0)","v":0},{"$f":"IF(Roster!$K$14=O$2,1,0)","v":0},{"$f":"IF(Roster!$K$14=P$2,1,0)","v":1},{"$f":"IF(Roster!$K$14=Q$2,1,0)","v":0},{"$f":"IF(Roster!$K$14=R$2,1,0)","v":0},{"$f":"IF(Roster!$K$14=S$2,1,0)","v":0},{"$f":"IF(Roster!$K$14=T$2,1,0)","v":0},{"$f":"IF(Roster!$K$14=U$2,1,0)","v":0},{"$f":"IF(Roster!$L$14=V$2,1,0)","v":0},{"$f":"IF(Roster!$L$14=W$2,1,0)","v":0},{"$f":"IF(Roster!$L$14=X$2,1,0)","v":0},{"$f":"IF(Roster!$L$14=Y$2,1,0)","v":0},{"$f":"IF(Roster!$L$14=Z$2,1,0)","v":0},{"$f":"IF(Roster!$L$14=AA$2,1,0)","v":0},{"$f":"IF(Roster!$L$14=AB$2,1,0)","v":0},{"$f":"IF(Roster!$L$14=AC$2,1,0)","v":1},{"$f":"IF(Roster!$L$14=AD$2,1,0)","v":0},{"$f":"IF(Roster!$L$14=AE$2,1,0)","v":0},{"$f":"IF(Roster!$L$14=AF$2,1,0)","v":0},{"$f":"IF(Roster!$L$14=AG$2,1,0)","v":0},{"$f":"IF(Roster!$M$14=AH$2,1,0)","v":0},{"$f":"IF(Roster!$M$14=AI$2,1,0)","v":0},{"$f":"IF(Roster!$M$14=AJ$2,1,0)","v":0},{"$f":"IF(Roster!$M$14=AK$2,1,0)","v":0},{"$f":"IF(Roster!$M$14=AL$2,1,0)","v":0},{"$f":"IF(Roster!$M$14=AM$2,1,0)","v":0},{"$f":"IF(Roster!$M$14=AN$2,1,0)","v":0},{"$f":"IF(Roster!$M$14=AO$2,1,0)","v":0},{"$f":"IF(Roster!$M$14=AP$2,1,0)","v":1},{"$f":"IF(Roster!$M$14=AQ$2,1,0)","v":0},{"$f":"IF(Roster!$M$14=AR$2,1,0)","v":0},{"$f":"IF(Roster!$M$14=AS$2,1,0)","v":0},{"$f":"IF(Roster!$N$14=AT$2,1,0)","v":0},{"$f":"IF(Roster!$N$14=AU$2,1,0)","v":0},{"$f":"IF(Roster!$N$14=AV$2,1,0)","v":0},{"$f":"IF(Roster!$N$14=AW$2,1,0)","v":0},{"$f":"IF(Roster!$N$14=AX$2,1,0)","v":0},{"$f":"IF(Roster!$N$14=AY$2,1,0)","v":0},{"$f":"IF(Roster!$N$14=AZ$2,1,0)","v":0},{"$f":"IF(Roster!$N$14=BA$2,1,0)","v":0},{"$f":"IF(Roster!$N$14=BB$2,1,0)","v":0},{"$f":"IF(Roster!$N$14=BC$2,1,0)","v":1},{"$f":"IF(Roster!$N$14=BD$2,1,0)","v":0},{"$f":"IF(Roster!$N$14=BE$2,1,0)","v":0},{"$f":"IF(Roster!$O$14=BF$2,1,0)","v":0},{"$f":"IF(Roster!$O$14=BG$2,1,0)","v":0},{"$f":"IF(Roster!$O$14=BH$2,1,0)","v":0},{"$f":"IF(Roster!$O$14=BI$2,1,0)","v":0},{"$f":"IF(Roster!$O$14=BJ$2,1,0)","v":0},{"$f":"IF(Roster!$O$14=BK$2,1,0)","v":0},{"$f":"IF(Roster!$O$14=BL$2,1,0)","v":0},{"$f":"IF(Roster!$O$14=BM$2,1,0)","v":0},{"$f":"IF(Roster!$O$14=BN$2,1,0)","v":0},{"$f":"IF(Roster!$O$14=BO$2,1,0)","v":0},{"$f":"IF(Roster!$O$14=BP$2,1,0)","v":1},{"$f":"IF(Roster!$O$14=BQ$2,1,0)","v":0},{"$f":"IF(Roster!$P$14=BR$2,1,0)","v":0},{"$f":"IF(Roster!$P$14=BS$2,1,0)","v":0},{"$f":"IF(Roster!$P$14=BT$2,1,0)","v":0},{"$f":"IF(Roster!$P$14=BU$2,1,0)","v":0},{"$f":"IF(Roster!$P$14=BV$2,1,0)","v":0},{"$f":"IF(Roster!$P$14=BW$2,1,0)","v":0},{"$f":"IF(Roster!$P$14=BX$2,1,0)","v":0},{"$f":"IF(Roster!$P$14=BY$2,1,0)","v":0},{"$f":"IF(Roster!$P$14=BZ$2,1,0)","v":0},{"$f":"IF(Roster!$P$14=CA$2,1,0)","v":0},{"$f":"IF(Roster!$P$14=CB$2,1,0)","v":0},{"$f":"IF(Roster!$P$14=CC$2,1,0)","v":1},null,"Saturday","Sat"]
[{"$f":"Roster!K9","v":10},{"$f":"Roster!L9","v":11},{"$f":"Roster!M9","v":12},{"$f":"Roster!N9","v":1},{"$f":"Roster!O9","v":2},{"$f":"Roster!P9","v":3},{"$f":"Roster!A9","v":8},{"$f":"IF(ISBLANK(Roster!D9),\"\",Roster!D9)","v":"Ike"},{"$f":"IF(H11=\"\",\"\",INDEX(Water,18,$G11)+INDEX(Stoves_Fuel,18,$G11)+INDEX(Meal_Cleanup,18,$G11)+INDEX(Site_Setup,18,$G11)+INDEX(Bear_Bags,18,$G11)+INDEX(Cook_Dinner,18,$G11))","v":7},{"$f":"IF(Roster!$K$15=J$2,1,0)","v":1},{"$f":"IF(Roster!$K$15=K$2,1,0)","v":0},{"$f":"IF(Roster!$K$15=L$2,1,0)","v":0},{"$f":"IF(Roster!$K$15=M$2,1,0)","v":0},{"$f":"IF(Roster!$K$15=N$2,1,0)","v":0},{"$f":"IF(Roster!$K$15=O$2,1,0)","v":0},{"$f":"IF(Roster!$K$15=P$2,1,0)","v":0},{"$f":"IF(Roster!$K$15=Q$2,1,0)","v":0},{"$f":"IF(Roster!$K$15=R$2,1,0)","v":0},{"$f":"IF(Roster!$K$15=S$2,1,0)","v":0},{"$f":"IF(Roster!$K$15=T$2,1,0)","v":0},{"$f":"IF(Roster!$K$15=U$2,1,0)","v":0},{"$f":"IF(Roster!$L$15=V$2,1,0)","v":0},{"$f":"IF(Roster!$L$15=W$2,1,0)","v":1},{"$f":"IF(Roster!$L$15=X$2,1,0)","v":0},{"$f":"IF(Roster!$L$15=Y$2,1,0)","v":0},{"$f":"IF(Roster!$L$15=Z$2,1,0)","v":0},{"$f":"IF(Roster!$L$15=AA$2,1,0)","v":0},{"$f":"IF(Roster!$L$15=AB$2,1,0)","v":0},{"$f":"IF(Roster!$L$15=AC$2,1,0)","v":0},{"$f":"IF(Roster!$L$15=AD$2,1,0)","v":0},{"$f":"IF(Roster!$L$15=AE$2,1,0)","v":0},{"$f":"IF(Roster!$L$15=AF$2,1,0)","v":0},{"$f":"IF(Roster!$L$15=AG$2,1,0)","v":0},{"$f":"IF(Roster!$M$15=AH$2,1,0)","v":0},{"$f":"IF(Roster!$M$15=AI$2,1,0)","v":0},{"$f":"IF(Roster!$M$15=AJ$2,1,0)","v":1},{"$f":"IF(Roster!$M$15=AK$2,1,0)","v":0},{"$f":"IF(Roster!$M$15=AL$2,1,0)","v":0},{"$f":"IF(Roster!$M$15=AM$2,1,0)","v":0},{"$f":"IF(Roster!$M$15=AN$2,1,0)","v":0},{"$f":"IF(Roster!$M$15=AO$2,1,0)","v":0},{"$f":"IF(Roster!$M$15=AP$2,1,0)","v":0},{"$f":"IF(Roster!$M$15=AQ$2,1,0)","v":0},{"$f":"IF(Roster!$M$15=AR$2,1,0)","v":0},{"$f":"IF(Roster!$M$15=AS$2,1,0)","v":0},{"$f":"IF(Roster!$N$15=AT$2,1,0)","v":0},{"$f":"IF(Roster!$N$15=AU$2,1,0)","v":0},{"$f":"IF(Roster!$N$15=AV$2,1,0)","v":0},{"$f":"IF(Roster!$N$15=AW$2,1,0)","v":1},{"$f":"IF(Roster!$N$15=AX$2,1,0)","v":0},{"$f":"IF(Roster!$N$15=AY$2,1,0)","v":0},{"$f":"IF(Roster!$N$15=AZ$2,1,0)","v":0},{"$f":"IF(Roster!$N$15=BA$2,1,0)","v":0},{"$f":"IF(Roster!$N$15=BB$2,1,0)","v":0},{"$f":"IF(Roster!$N$15=BC$2,1,0)","v":0},{"$f":"IF(Roster!$N$15=BD$2,1,0)","v":0},{"$f":"IF(Roster!$N$15=BE$2,1,0)","v":0},{"$f":"IF(Roster!$O$15=BF$2,1,0)","v":0},{"$f":"IF(Roster!$O$15=BG$2,1,0)","v":0},{"$f":"IF(Roster!$O$15=BH$2,1,0)","v":0},{"$f":"IF(Roster!$O$15=BI$2,1,0)","v":0},{"$f":"IF(Roster!$O$15=BJ$2,1,0)","v":1},{"$f":"IF(Roster!$O$15=BK$2,1,0)","v":0},{"$f":"IF(Roster!$O$15=BL$2,1,0)","v":0},{"$f":"IF(Roster!$O$15=BM$2,1,0)","v":0},{"$f":"IF(Roster!$O$15=BN$2,1,0)","v":0},{"$f":"IF(Roster!$O$15=BO$2,1,0)","v":0},{"$f":"IF(Roster!$O$15=BP$2,1,0)","v":0},{"$f":"IF(Roster!$O$15=BQ$2,1,0)","v":0},{"$f":"IF(Roster!$P$15=BR$2,1,0)","v":0},{"$f":"IF(Roster!$P$15=BS$2,1,0)","v":0},{"$f":"IF(Roster!$P$15=BT$2,1,0)","v":0},{"$f":"IF(Roster!$P$15=BU$2,1,0)","v":0},{"$f":"IF(Roster!$P$15=BV$2,1,0)","v":0},{"$f":"IF(Roster!$P$15=BW$2,1,0)","v":0},{"$f":"IF(Roster!$P$15=BX$2,1,0)","v":0},{"$f":"IF(Roster!$P$15=BY$2,1,0)","v":0},{"$f":"IF(Roster!$P$15=BZ$2,1,0)","v":1},{"$f":"IF(Roster!$P$15=CA$2,1,0)","v":0},{"$f":"IF(Roster!$P$15=CB$2,1,0)","v":0},{"$f":"IF(Roster!$P$15=CC$2,1,0)","v":0}]
[{"$f":"Roster!K10","v":5},{"$f":"Roster!L10","v":6},{"$f":"Roster!M10","v":7},{"$f":"Roster!N10","v":8},{"$f":"Roster!O10","v":9},{"$f":"Roster!P10","v":10},{"$f":"Roster!A10","v":9},{"$f":"IF(ISBLANK(Roster!D10),\"\",Roster!D10)","v":"John"},{"$f":"IF(H12=\"\",\"\",INDEX(Water,18,$G12)+INDEX(Stoves_Fuel,18,$G12)+INDEX(Meal_Cleanup,18,$G12)+INDEX(Site_Setup,18,$G12)+INDEX(Bear_Bags,18,$G12)+INDEX(Cook_Dinner,18,$G12))","v":7},{"$f":"IF(Roster!$K$16=J$2,1,0)","v":0},{"$f":"IF(Roster!$K$16=K$2,1,0)","v":0},{"$f":"IF(Roster!$K$16=L$2,1,0)","v":0},{"$f":"IF(Roster!$K$16=M$2,1,0)","v":0},{"$f":"IF(Roster!$K$16=N$2,1,0)","v":0},{"$f":"IF(Roster!$K$16=O$2,1,0)","v":0},{"$f":"IF(Roster!$K$16=P$2,1,0)","v":0},{"$f":"IF(Roster!$K$16=Q$2,1,0)","v":1},{"$f":"IF(Roster!$K$16=R$2,1,0)","v":0},{"$f":"IF(Roster!$K$16=S$2,1,0)","v":0},{"$f":"IF(Roster!$K$16=T$2,1,0)","v":0},{"$f":"IF(Roster!$K$16=U$2,1,0)","v":0},{"$f":"IF(Roster!$L$16=V$2,1,0)","v":0},{"$f":"IF(Roster!$L$16=W$2,1,0)","v":0},{"$f":"IF(Roster!$L$16=X$2,1,0)","v":0},{"$f":"IF(Roster!$L$16=Y$2,1,0)","v":0},{"$f":"IF(Roster!$L$16=Z$2,1,0)","v":0},{"$f":"IF(Roster!$L$16=AA$2,1,0)","v":0},{"$f":"IF(Roster!$L$16=AB$2,1,0)","v":0},{"$f":"IF(Roster!$L$16=AC$2,1,0)","v":0},{"$f":"IF(Roster!$L$16=AD$2,1,0)","v":1},{"$f":"IF(Roster!$L$16=AE$2,1,0)","v":0},{"$f":"IF(Roster!$L$16=AF$2,1,0)","v":0},{"$f":"IF(Roster!$L$16=AG$2,1,0)","v":0},{"$f":"IF(Roster!$M$16=AH$2,1,0)","v":0},{"$f":"IF(Roster!$M$16=AI$2,1,0)","v":0},{"$f":"IF(Roster!$M$16=AJ$2,1,0)","v":0},{"$f":"IF(Roster!$M$16=AK$2,1,0)","v":0},{"$f":"IF(Roster!$M$16=AL$2,1,0)","v":0},{"$f":"IF(Roster!$M$16=AM$2,1,0)","v":0},{"$f":"IF(Roster!$M$16=AN$2,1,0)","v":0},{"$f":"IF(Roster!$M$16=AO$2,1,0)","v":0},{"$f":"IF(Roster!$M$16=AP$2,1,0)","v":0},{"$f":"IF(Roster!$M$16=AQ$2,1,0)","v":1},{"$f":"IF(Roster!$M$16=AR$2,1,0)","v":0},{"$f":"IF(Roster!$M$16=AS$2,1,0)","v":0},{"$f":"IF(Roster!$N$16=AT$2,1,0)","v":0},{"$f":"IF(Roster!$N$16=AU$2,1,0)","v":0},{"$f":"IF(Roster!$N$16=AV$2,1,0)","v":0},{"$f":"IF(Roster!$N$16=AW$2,1,0)","v":0},{"$f":"IF(Roster!$N$16=AX$2,1,0)","v":0},{"$f":"IF(Roster!$N$16=AY$2,1,0)","v":0},{"$f":"IF(Roster!$N$16=AZ$2,1,0)","v":0},{"$f":"IF(Roster!$N$16=BA$2,1,0)","v":0},{"$f":"IF(Roster!$N$16=BB$2,1,0)","v":0},{"$f":"IF(Roster!$N$16=BC$2,1,0)","v":0},{"$f":"IF(Roster!$N$16=BD$2,1,0)","v":1},{"$f":"IF(Roster!$N$16=BE$2,1,0)","v":0},{"$f":"IF(Roster!$O$16=BF$2,1,0)","v":0},{"$f":"IF(Roster!$O$16=BG$2,1,0)","v":0},{"$f":"IF(Roster!$O$16=BH$2,1,0)","v":0},{"$f":"IF(Roster!$O$16=BI$2,1,0)","v":0},{"$f":"IF(Roster!$O$16=BJ$2,1,0)","v":0},{"$f":"IF(Roster!$O$16=BK$2,1,0)","v":0},{"$f":"IF(Roster!$O$16=BL$2,1,0)","v":0},{"$f":"IF(Roster!$O$16=BM$2,1,0)","v":0},{"$f":"IF(Roster!$O$16=BN$2,1,0)","v":0},{"$f":"IF(Roster!$O$16=BO$2,1,0)","v":0},{"$f":"IF(Roster!$O$16=BP$2,1,0)","v":0},{"$f":"IF(Roster!$O$16=BQ$2,1,0)","v":1},{"$f":"IF(Roster!$P$16=BR$2,1,0)","v":1},{"$f":"IF(Roster!$P$16=BS$2,1,0)","v":0},{"$f":"IF(Roster!$P$16=BT$2,1,0)","v":0},{"$f":"IF(Roster!$P$16=BU$2,1,0)","v":0},{"$f":"IF(Roster!$P$16=BV$2,1,0)","v":0},{"$f":"IF(Roster!$P$16=BW$2,1,0)","v":0},{"$f":"IF(Roster!$P$16=BX$2,1,0)","v":0},{"$f":"IF(Roster!$P$16=BY$2,1,0)","v":0},{"$f":"IF(Roster!$P$16=BZ$2,1,0)","v":0},{"$f":"IF(Roster!$P$16=CA$2,1,0)","v":0},{"$f":"IF(Roster!$P$16=CB$2,1,0)","v":0},{"$f":"IF(Roster!$P$16=CC$2,1,0)","v":0}]
[{"$f":"Roster!K11","v":11},{"$f":"Roster!L11","v":12},{"$f":"Roster!M11","v":1},{"$f":"Roster!N11","v":2},{"$f":"Roster!O11","v":3},{"$f":"Roster!P11","v":4},{"$f":"Roster!A11","v":10},{"$f":"IF(ISBLANK(Roster!D11),\"\",Roster!D11)","v":"Bill"},{"$f":"IF(H13=\"\",\"\",INDEX(Water,18,$G13)+INDEX(Stoves_Fuel,18,$G13)+INDEX(Meal_Cleanup,18,$G13)+INDEX(Site_Setup,18,$G13)+INDEX(Bear_Bags,18,$G13)+INDEX(Cook_Dinner,18,$G13))","v":7},{"$f":"IF(Roster!$K$17=J$2,1,0)","v":0},{"$f":"IF(Roster!$K$17=K$2,1,0)","v":1},{"$f":"IF(Roster!$K$17=L$2,1,0)","v":0},{"$f":"IF(Roster!$K$17=M$2,1,0)","v":0},{"$f":"IF(Roster!$K$17=N$2,1,0)","v":0},{"$f":"IF(Roster!$K$17=O$2,1,0)","v":0},{"$f":"IF(Roster!$K$17=P$2,1,0)","v":0},{"$f":"IF(Roster!$K$17=Q$2,1,0)","v":0},{"$f":"IF(Roster!$K$17=R$2,1,0)","v":0},{"$f":"IF(Roster!$K$17=S$2,1,0)","v":0},{"$f":"IF(Roster!$K$17=T$2,1,0)","v":0},{"$f":"IF(Roster!$K$17=U$2,1,0)","v":0},{"$f":"IF(Roster!$L$17=V$2,1,0)","v":0},{"$f":"IF(Roster!$L$17=W$2,1,0)","v":0},{"$f":"IF(Roster!$L$17=X$2,1,0)","v":1},{"$f":"IF(Roster!$L$17=Y$2,1,0)","v":0},{"$f":"IF(Roster!$L$17=Z$2,1,0)","v":0},{"$f":"IF(Roster!$L$17=AA$2,1,0)","v":0},{"$f":"IF(Roster!$L$17=AB$2,1,0)","v":0},{"$f":"IF(Roster!$L$17=AC$2,1,0)","v":0},{"$f":"IF(Roster!$L$17=AD$2,1,0)","v":0},{"$f":"IF(Roster!$L$17=AE$2,1,0)","v":0},{"$f":"IF(Roster!$L$17=AF$2,1,0)","v":0},{"$f":"IF(Roster!$L$17=AG$2,1,0)","v":0},{"$f":"IF(Roster!$M$17=AH$2,1,0)","v":0},{"$f":"IF(Roster!$M$17=AI$2,1,0)","v":0},{"$f":"IF(Roster!$M$17=AJ$2,1,0)","v":0},{"$f":"IF(Roster!$M$17=AK$2,1,0)","v":1},{"$f":"IF(Roster!$M$17=AL$2,1,0)","v":0},{"$f":"IF(Roster!$M$17=AM$2,1,0)","v":0},{"$f":"IF(Roster!$M$17=AN$2,1,0)","v":0},{"$f":"IF(Roster!$M$17=AO$2,1,0)","v":0},{"$f":"IF(Roster!$M$17=AP$2,1,0)","v":0},{"$f":"IF(Roster!$M$17=AQ$2,1,0)","v":0},{"$f":"IF(Roster!$M$17=AR$2,1,0)","v":0},{"$f":"IF(Roster!$M$17=AS$2,1,0)","v":0},{"$f":"IF(Roster!$N$17=AT$2,1,0)","v":0},{"$f":"IF(Roster!$N$17=AU$2,1,0)","v":0},{"$f":"IF(Roster!$N$17=AV$2,1,0)","v":0},{"$f":"IF(Roster!$N$17=AW$2,1,0)","v":0},{"$f":"IF(Roster!$N$17=AX$2,1,0)","v":1},{"$f":"IF(Roster!$N$17=AY$2,1,0)","v":0},{"$f":"IF(Roster!$N$17=AZ$2,1,0)","v":0},{"$f":"IF(Roster!$N$17=BA$2,1,0)","v":0},{"$f":"IF(Roster!$N$17=BB$2,1,0)","v":0},{"$f":"IF(Roster!$N$17=BC$2,1,0)","v":0},{"$f":"IF(Roster!$N$17=BD$2,1,0)","v":0},{"$f":"IF(Roster!$N$17=BE$2,1,0)","v":0},{"$f":"IF(Roster!$O$17=BF$2,1,0)","v":0},{"$f":"IF(Roster!$O$17=BG$2,1,0)","v":0},{"$f":"IF(Roster!$O$17=BH$2,1,0)","v":0},{"$f":"IF(Roster!$O$17=BI$2,1,0)","v":0},{"$f":"IF(Roster!$O$17=BJ$2,1,0)","v":0},{"$f":"IF(Roster!$O$17=BK$2,1,0)","v":1},{"$f":"IF(Roster!$O$17=BL$2,1,0)","v":0},{"$f":"IF(Roster!$O$17=BM$2,1,0)","v":0},{"$f":"IF(Roster!$O$17=BN$2,1,0)","v":0},{"$f":"IF(Roster!$O$17=BO$2,1,0)","v":0},{"$f":"IF(Roster!$O$17=BP$2,1,0)","v":0},{"$f":"IF(Roster!$O$17=BQ$2,1,0)","v":0},{"$f":"IF(Roster!$P$17=BR$2,1,0)","v":0},{"$f":"IF(Roster!$P$17=BS$2,1,0)","v":0},{"$f":"IF(Roster!$P$17=BT$2,1,0)","v":0},{"$f":"IF(Roster!$P$17=BU$2,1,0)","v":0},{"$f":"IF(Roster!$P$17=BV$2,1,0)","v":0},{"$f":"IF(Roster!$P$17=BW$2,1,0)","v":0},{"$f":"IF(Roster!$P$17=BX$2,1,0)","v":1},{"$f":"IF(Roster!$P$17=BY$2,1,0)","v":0},{"$f":"IF(Roster!$P$17=BZ$2,1,0)","v":0},{"$f":"IF(Roster!$P$17=CA$2,1,0)","v":0},{"$f":"IF(Roster!$P$17=CB$2,1,0)","v":0},{"$f":"IF(Roster!$P$17=CC$2,1,0)","v":0}]
[{"$f":"Roster!K12","v":6},{"$f":"Roster!L12","v":7},{"$f":"Roster!M12","v":8},{"$f":"Roster!N12","v":9},{"$f":"Roster!O12","v":10},{"$f":"Roster!P12","v":11},{"$f":"Roster!A12","v":11},{"$f":"IF(ISBLANK(Roster!D12),\"\",Roster!D12)","v":"Waite"},{"$f":"IF(H14=\"\",\"\",INDEX(Water,18,$G14)+INDEX(Stoves_Fuel,18,$G14)+INDEX(Meal_Cleanup,18,$G14)+INDEX(Site_Setup,18,$G14)+INDEX(Bear_Bags,18,$G14)+INDEX(Cook_Dinner,18,$G14))","v":7},{"$f":"IF(Roster!$K$18=J$2,1,0)","v":0},{"$f":"IF(Roster!$K$18=K$2,1,0)","v":0},{"$f":"IF(Roster!$K$18=L$2,1,0)","v":0},{"$f":"IF(Roster!$K$18=M$2,1,0)","v":0},{"$f":"IF(Roster!$K$18=N$2,1,0)","v":0},{"$f":"IF(Roster!$K$18=O$2,1,0)","v":0},{"$f":"IF(Roster!$K$18=P$2,1,0)","v":0},{"$f":"IF(Roster!$K$18=Q$2,1,0)","v":0},{"$f":"IF(Roster!$K$18=R$2,1,0)","v":1},{"$f":"IF(Roster!$K$18=S$2,1,0)","v":0},{"$f":"IF(Roster!$K$18=T$2,1,0)","v":0},{"$f":"IF(Roster!$K$18=U$2,1,0)","v":0},{"$f":"IF(Roster!$L$18=V$2,1,0)","v":0},{"$f":"IF(Roster!$L$18=W$2,1,0)","v":0},{"$f":"IF(Roster!$L$18=X$2,1,0)","v":0},{"$f":"IF(Roster!$L$18=Y$2,1,0)","v":0},{"$f":"IF(Roster!$L$18=Z$2,1,0)","v":0},{"$f":"IF(Roster!$L$18=AA$2,1,0)","v":0},{"$f":"IF(Roster!$L$18=AB$2,1,0)","v":0},{"$f":"IF(Roster!$L$18=AC$2,1,0)","v":0},{"$f":"IF(Roster!$L$18=AD$2,1,0)","v":0},{"$f":"IF(Roster!$L$18=AE$2,1,0)","v":1},{"$f":"IF(Roster!$L$18=AF$2,1,0)","v":0},{"$f":"IF(Roster!$L$18=AG$2,1,0)","v":0},{"$f":"IF(Roster!$M$18=AH$2,1,0)","v":0},{"$f":"IF(Roster!$M$18=AI$2,1,0)","v":0},{"$f":"IF(Roster!$M$18=AJ$2,1,0)","v":0},{"$f":"IF(Roster!$M$18=AK$2,1,0)","v":0},{"$f":"IF(Roster!$M$18=AL$2,1,0)","v":0},{"$f":"IF(Roster!$M$18=AM$2,1,0)","v":0},{"$f":"IF(Roster!$M$18=AN$2,1,0)","v":0},{"$f":"IF(Roster!$M$18=AO$2,1,0)","v":0},{"$f":"IF(Roster!$M$18=AP$2,1,0)","v":0},{"$f":"IF(Roster!$M$18=AQ$2,1,0)","v":0},{"$f":"IF(Roster!$M$18=AR$2,1,0)","v":1},{"$f":"IF(Roster!$M$18=AS$2,1,0)","v":0},{"$f":"IF(Roster!$N$18=AT$2,1,0)","v":0},{"$f":"IF(Roster!$N$18=AU$2,1,0)","v":0},{"$f":"IF(Roster!$N$18=AV$2,1,0)","v":0},{"$f":"IF(Roster!$N$18=AW$2,1,0)","v":0},{"$f":"IF(Roster!$N$18=AX$2,1,0)","v":0},{"$f":"IF(Roster!$N$18=AY$2,1,0)","v":0},{"$f":"IF(Roster!$N$18=AZ$2,1,0)","v":0},{"$f":"IF(Roster!$N$18=BA$2,1,0)","v":0},{"$f":"IF(Roster!$N$18=BB$2,1,0)","v":0},{"$f":"IF(Roster!$N$18=BC$2,1,0)","v":0},{"$f":"IF(Roster!$N$18=BD$2,1,0)","v":0},{"$f":"IF(Roster!$N$18=BE$2,1,0)","v":1},{"$f":"IF(Roster!$O$18=BF$2,1,0)","v":1},{"$f":"IF(Roster!$O$18=BG$2,1,0)","v":0},{"$f":"IF(Roster!$O$18=BH$2,1,0)","v":0},{"$f":"IF(Roster!$O$18=BI$2,1,0)","v":0},{"$f":"IF(Roster!$O$18=BJ$2,1,0)","v":0},{"$f":"IF(Roster!$O$18=BK$2,1,0)","v":0},{"$f":"IF(Roster!$O$18=BL$2,1,0)","v":0},{"$f":"IF(Roster!$O$18=BM$2,1,0)","v":0},{"$f":"IF(Roster!$O$18=BN$2,1,0)","v":0},{"$f":"IF(Roster!$O$18=BO$2,1,0)","v":0},{"$f":"IF(Roster!$O$18=BP$2,1,0)","v":0},{"$f":"IF(Roster!$O$18=BQ$2,1,0)","v":0},{"$f":"IF(Roster!$P$18=BR$2,1,0)","v":0},{"$f":"IF(Roster!$P$18=BS$2,1,0)","v":1},{"$f":"IF(Roster!$P$18=BT$2,1,0)","v":0},{"$f":"IF(Roster!$P$18=BU$2,1,0)","v":0},{"$f":"IF(Roster!$P$18=BV$2,1,0)","v":0},{"$f":"IF(Roster!$P$18=BW$2,1,0)","v":0},{"$f":"IF(Roster!$P$18=BX$2,1,0)","v":0},{"$f":"IF(Roster!$P$18=BY$2,1,0)","v":0},{"$f":"IF(Roster!$P$18=BZ$2,1,0)","v":0},{"$f":"IF(Roster!$P$18=CA$2,1,0)","v":0},{"$f":"IF(Roster!$P$18=CB$2,1,0)","v":0},{"$f":"IF(Roster!$P$18=CC$2,1,0)","v":0}]
[{"$f":"Roster!K13","v":12},{"$f":"Roster!L13","v":1},{"$f":"Roster!M13","v":2},{"$f":"Roster!N13","v":3},{"$f":"Roster!O13","v":4},{"$f":"Roster!P13","v":5},{"$f":"Roster!A13","v":12},{"$f":"IF(ISBLANK(Roster!D13),\"\",Roster!D13)","v":"George"},{"$f":"IF(H15=\"\",\"\",INDEX(Water,18,$G15)+INDEX(Stoves_Fuel,18,$G15)+INDEX(Meal_Cleanup,18,$G15)+INDEX(Site_Setup,18,$G15)+INDEX(Bear_Bags,18,$G15)+INDEX(Cook_Dinner,18,$G15))","v":7},{"$f":"IF(Roster!$K$19=J$2,1,0)","v":0},{"$f":"IF(Roster!$K$19=K$2,1,0)","v":0},{"$f":"IF(Roster!$K$19=L$2,1,0)","v":1},{"$f":"IF(Roster!$K$19=M$2,1,0)","v":0},{"$f":"IF(Roster!$K$19=N$2,1,0)","v":0},{"$f":"IF(Roster!$K$19=O$2,1,0)","v":0},{"$f":"IF(Roster!$K$19=P$2,1,0)","v":0},{"$f":"IF(Roster!$K$19=Q$2,1,0)","v":0},{"$f":"IF(Roster!$K$19=R$2,1,0)","v":0},{"$f":"IF(Roster!$K$19=S$2,1,0)","v":0},{"$f":"IF(Roster!$K$19=T$2,1,0)","v":0},{"$f":"IF(Roster!$K$19=U$2,1,0)","v":0},{"$f":"IF(Roster!$L$19=V$2,1,0)","v":0},{"$f":"IF(Roster!$L$19=W$2,1,0)","v":0},{"$f":"IF(Roster!$L$19=X$2,1,0)","v":0},{"$f":"IF(Roster!$L$19=Y$2,1,0)","v":1},{"$f":"IF(Roster!$L$19=Z$2,1,0)","v":0},{"$f":"IF(Roster!$L$19=AA$2,1,0)","v":0},{"$f":"IF(Roster!$L$19=AB$2,1,0)","v":0},{"$f":"IF(Roster!$L$19=AC$2,1,0)","v":0},{"$f":"IF(Roster!$L$19=AD$2,1,0)","v":0},{"$f":"IF(Roster!$L$19=AE$2,1,0)","v":0},{"$f":"IF(Roster!$L$19=AF$2,1,0)","v":0},{"$f":"IF(Roster!$L$19=AG$2,1,0)","v":0},{"$f":"IF(Roster!$M$19=AH$2,1,0)","v":0},{"$f":"IF(Roster!$M$19=AI$2,1,0)","v":0},{"$f":"IF(Roster!$M$19=AJ$2,1,0)","v":0},{"$f":"IF(Roster!$M$19=AK$2,1,0)","v":0},{"$f":"IF(Roster!$M$19=AL$2,1,0)","v":1},{"$f":"IF(Roster!$M$19=AM$2,1,0)","v":0},{"$f":"IF(Roster!$M$19=AN$2,1,0)","v":0},{"$f":"IF(Roster!$M$19=AO$2,1,0)","v":0},{"$f":"IF(Roster!$M$19=AP$2,1,0)","v":0},{"$f":"IF(Roster!$M$19=AQ$2,1,0)","v":0},{"$f":"IF(Roster!$M$19=AR$2,1,0)","v":0},{"$f":"IF(Roster!$M$19=AS$2,1,0)","v":0},{"$f":"IF(Roster!$N$19=AT$2,1,0)","v":0},{"$f":"IF(Roster!$N$19=AU$2,1,0)","v":0},{"$f":"IF(Roster!$N$19=AV$2,1,0)","v":0},{"$f":"IF(Roster!$N$19=AW$2,1,0)","v":0},{"$f":"IF(Roster!$N$19=AX$2,1,0)","v":0},{"$f":"IF(Roster!$N$19=AY$2,1,0)","v":1},{"$f":"IF(Roster!$N$19=AZ$2,1,0)","v":0},{"$f":"IF(Roster!$N$19=BA$2,1,0)","v":0},{"$f":"IF(Roster!$N$19=BB$2,1,0)","v":0},{"$f":"IF(Roster!$N$19=BC$2,1,0)","v":0},{"$f":"IF(Roster!$N$19=BD$2,1,0)","v":0},{"$f":"IF(Roster!$N$19=BE$2,1,0)","v":0},{"$f":"IF(Roster!$O$19=BF$2,1,0)","v":0},{"$f":"IF(Roster!$O$19=BG$2,1,0)","v":0},{"$f":"IF(Roster!$O$19=BH$2,1,0)","v":0},{"$f":"IF(Roster!$O$19=BI$2,1,0)","v":0},{"$f":"IF(Roster!$O$19=BJ$2,1,0)","v":0},{"$f":"IF(Roster!$O$19=BK$2,1,0)","v":0},{"$f":"IF(Roster!$O$19=BL$2,1,0)","v":1},{"$f":"IF(Roster!$O$19=BM$2,1,0)","v":0},{"$f":"IF(Roster!$O$19=BN$2,1,0)","v":0},{"$f":"IF(Roster!$O$19=BO$2,1,0)","v":0},{"$f":"IF(Roster!$O$19=BP$2,1,0)","v":0},{"$f":"IF(Roster!$O$19=BQ$2,1,0)","v":0},{"$f":"IF(Roster!$P$19=BR$2,1,0)","v":0},{"$f":"IF(Roster!$P$19=BS$2,1,0)","v":0},{"$f":"IF(Roster!$P$19=BT$2,1,0)","v":0},{"$f":"IF(Roster!$P$19=BU$2,1,0)","v":0},{"$f":"IF(Roster!$P$19=BV$2,1,0)","v":0},{"$f":"IF(Roster!$P$19=BW$2,1,0)","v":0},{"$f":"IF(Roster!$P$19=BX$2,1,0)","v":0},{"$f":"IF(Roster!$P$19=BY$2,1,0)","v":1},{"$f":"IF(Roster!$P$19=BZ$2,1,0)","v":0},{"$f":"IF(Roster!$P$19=CA$2,1,0)","v":0},{"$f":"IF(Roster!$P$19=CB$2,1,0)","v":0},{"$f":"IF(Roster!$P$19=CC$2,1,0)","v":0}]
[{"$f":"Roster!K14","v":7},{"$f":"Roster!L14","v":8},{"$f":"Roster!M14","v":9},{"$f":"Roster!N14","v":10},{"$f":"Roster!O14","v":11},{"$f":"Roster!P14","v":12},null,null,null,{"$f":"IF(Roster!$K$20=J$2,1,0)","v":0},{"$f":"IF(Roster!$K$20=K$2,1,0)","v":0},{"$f":"IF(Roster!$K$20=L$2,1,0)","v":0},{"$f":"IF(Roster!$K$20=M$2,1,0)","v":0},{"$f":"IF(Roster!$K$20=N$2,1,0)","v":0},{"$f":"IF(Roster!$K$20=O$2,1,0)","v":0},{"$f":"IF(Roster!$K$20=P$2,1,0)","v":0},{"$f":"IF(Roster!$K$20=Q$2,1,0)","v":0},{"$f":"IF(Roster!$K$20=R$2,1,0)","v":0},{"$f":"IF(Roster!$K$20=S$2,1,0)","v":1},{"$f":"IF(Roster!$K$20=T$2,1,0)","v":0},{"$f":"IF(Roster!$K$20=U$2,1,0)","v":0},{"$f":"IF(Roster!$L$20=V$2,1,0)","v":0},{"$f":"IF(Roster!$L$20=W$2,1,0)","v":0},{"$f":"IF(Roster!$L$20=X$2,1,0)","v":0},{"$f":"IF(Roster!$L$20=Y$2,1,0)","v":0},{"$f":"IF(Roster!$L$20=Z$2,1,0)","v":0},{"$f":"IF(Roster!$L$20=AA$2,1,0)","v":0},{"$f":"IF(Roster!$L$20=AB$2,1,0)","v":0},{"$f":"IF(Roster!$L$20=AC$2,1,0)","v":0},{"$f":"IF(Roster!$L$20=AD$2,1,0)","v":0},{"$f":"IF(Roster!$L$20=AE$2,1,0)","v":0},{"$f":"IF(Roster!$L$20=AF$2,1,0)","v":1},{"$f":"IF(Roster!$L$20=AG$2,1,0)","v":0},{"$f":"IF(Roster!$M$20=AH$2,1,0)","v":0},{"$f":"IF(Roster!$M$20=AI$2,1,0)","v":0},{"$f":"IF(Roster!$M$20=AJ$2,1,0)","v":0},{"$f":"IF(Roster!$M$20=AK$2,1,0)","v":0},{"$f":"IF(Roster!$M$20=AL$2,1,0)","v":0},{"$f":"IF(Roster!$M$20=AM$2,1,0)","v":0},{"$f":"IF(Roster!$M$20=AN$2,1,0)","v":0},{"$f":"IF(Roster!$M$20=AO$2,1,0)","v":0},{"$f":"IF(Roster!$M$20=AP$2,1,0)","v":0},{"$f":"IF(Roster!$M$20=AQ$2,1,0)","v":0},{"$f":"IF(Roster!$M$20=AR$2,1,0)","v":0},{"$f":"IF(Roster!$M$20=AS$2,1,0)","v":1},{"$f":"IF(Roster!$N$20=AT$2,1,0)","v":1},{"$f":"IF(Roster!$N$20=AU$2,1,0)","v":0},{"$f":"IF(Roster!$N$20=AV$2,1,0)","v":0},{"$f":"IF(Roster!$N$20=AW$2,1,0)","v":0},{"$f":"IF(Roster!$N$20=AX$2,1,0)","v":0},{"$f":"IF(Roster!$N$20=AY$2,1,0)","v":0},{"$f":"IF(Roster!$N$20=AZ$2,1,0)","v":0},{"$f":"IF(Roster!$N$20=BA$2,1,0)","v":0},{"$f":"IF(Roster!$N$20=BB$2,1,0)","v":0},{"$f":"IF(Roster!$N$20=BC$2,1,0)","v":0},{"$f":"IF(Roster!$N$20=BD$2,1,0)","v":0},{"$f":"IF(Roster!$N$20=BE$2,1,0)","v":0},{"$f":"IF(Roster!$O$20=BF$2,1,0)","v":0},{"$f":"IF(Roster!$O$20=BG$2,1,0)","v":1},{"$f":"IF(Roster!$O$20=BH$2,1,0)","v":0},{"$f":"IF(Roster!$O$20=BI$2,1,0)","v":0},{"$f":"IF(Roster!$O$20=BJ$2,1,0)","v":0},{"$f":"IF(Roster!$O$20=BK$2,1,0)","v":0},{"$f":"IF(Roster!$O$20=BL$2,1,0)","v":0},{"$f":"IF(Roster!$O$20=BM$2,1,0)","v":0},{"$f":"IF(Roster!$O$20=BN$2,1,0)","v":0},{"$f":"IF(Roster!$O$20=BO$2,1,0)","v":0},{"$f":"IF(Roster!$O$20=BP$2,1,0)","v":0},{"$f":"IF(Roster!$O$20=BQ$2,1,0)","v":0},{"$f":"IF(Roster!$P$20=BR$2,1,0)","v":0},{"$f":"IF(Roster!$P$20=BS$2,1,0)","v":0},{"$f":"IF(Roster!$P$20=BT$2,1,0)","v":1},{"$f":"IF(Roster!$P$20=BU$2,1,0)","v":0},{"$f":"IF(Roster!$P$20=BV$2,1,0)","v":0},{"$f":"IF(Roster!$P$20=BW$2,1,0)","v":0},{"$f":"IF(Roster!$P$20=BX$2,1,0)","v":0},{"$f":"IF(Roster!$P$20=BY$2,1,0)","v":0},{"$f":"IF(Roster!$P$20=BZ$2,1,0)","v":0},{"$f":"IF(Roster!$P$20=CA$2,1,0)","v":0},{"$f":"IF(Roster!$P$20=CB$2,1,0)","v":0},{"$f":"IF(Roster!$P$20=CC$2,1,0)","v":0}]
[{"$f":"Roster!K15","v":1},{"$f":"Roster!L15","v":2},{"$f":"Roster!M15","v":3},{"$f":"Roster!N15","v":4},{"$f":"Roster!O15","v":5},{"$f":"Roster!P15","v":9},null,null,null,{"$f":"IF(Roster!$K$21=J$2,1,0)","v":0},{"$f":"IF(Roster!$K$21=K$2,1,0)","v":0},{"$f":"IF(Roster!$K$21=L$2,1,0)","v":0},{"$f":"IF(Roster!$K$21=M$2,1,0)","v":1},{"$f":"IF(Roster!$K$21=N$2,1,0)","v":0},{"$f":"IF(Roster!$K$21=O$2,1,0)","v":0},{"$f":"IF(Roster!$K$21=P$2,1,0)","v":0},{"$f":"IF(Roster!$K$21=Q$2,1,0)","v":0},{"$f":"IF(Roster!$K$21=R$2,1,0)","v":0},{"$f":"IF(Roster!$K$21=S$2,1,0)","v":0},{"$f":"IF(Roster!$K$21=T$2,1,0)","v":0},{"$f":"IF(Roster!$K$21=U$2,1,0)","v":0},{"$f":"IF(Roster!$L$21=V$2,1,0)","v":0},{"$f":"IF(Roster!$L$21=W$2,1,0)","v":0},{"$f":"IF(Roster!$L$21=X$2,1,0)","v":0},{"$f":"IF(Roster!$L$21=Y$2,1,0)","v":0},{"$f":"IF(Roster!$L$21=Z$2,1,0)","v":1},{"$f":"IF(Roster!$L$21=AA$2,1,0)","v":0},{"$f":"IF(Roster!$L$21=AB$2,1,0)","v":0},{"$f":"IF(Roster!$L$21=AC$2,1,0)","v":0},{"$f":"IF(Roster!$L$21=AD$2,1,0)","v":0},{"$f":"IF(Roster!$L$21=AE$2,1,0)","v":0},{"$f":"IF(Roster!$L$21=AF$2,1,0)","v":0},{"$f":"IF(Roster!$L$21=AG$2,1,0)","v":0},{"$f":"IF(Roster!$M$21=AH$2,1,0)","v":0},{"$f":"IF(Roster!$M$21=AI$2,1,0)","v":0},{"$f":"IF(Roster!$M$21=AJ$2,1,0)","v":0},{"$f":"IF(Roster!$M$21=AK$2,1,0)","v":0},{"$f":"IF(Roster!$M$21=AL$2,1,0)","v":0},{"$f":"IF(Roster!$M$21=AM$2,1,0)","v":1},{"$f":"IF(Roster!$M$21=AN$2,1,0)","v":0},{"$f":"IF(Roster!$M$21=AO$2,1,0)","v":0},{"$f":"IF(Roster!$M$21=AP$2,1,0)","v":0},{"$f":"IF(Roster!$M$21=AQ$2,1,0)","v":0},{"$f":"IF(Roster!$M$21=AR$2,1,0)","v":0},{"$f":"IF(Roster!$M$21=AS$2,1,0)","v":0},{"$f":"IF(Roster!$N$21=AT$2,1,0)","v":0},{"$f":"IF(Roster!$N$21=AU$2,1,0)","v":0},{"$f":"IF(Roster!$N$21=AV$2,1,0)","v":0},{"$f":"IF(Roster!$N$21=AW$2,1,0)","v":0},{"$f":"IF(Roster!$N$21=AX$2,1,0)","v":0},{"$f":"IF(Roster!$N$21=AY$2,1,0)","v":0},{"$f":"IF(Roster!$N$21=AZ$2,1,0)","v":1},{"$f":"IF(Roster!$N$21=BA$2,1,0)","v":0},{"$f":"IF(Roster!$N$21=BB$2,1,0)","v":0},{"$f":"IF(Roster!$N$21=BC$2,1,0)","v":0},{"$f":"IF(Roster!$N$21=BD$2,1,0)","v":0},{"$f":"IF(Roster!$N$21=BE$2,1,0)","v":0},{"$f":"IF(Roster!$O$21=BF$2,1,0)","v":0},{"$f":"IF(Roster!$O$21=BG$2,1,0)","v":0},{"$f":"IF(Roster!$O$21=BH$2,1,0)","v":0},{"$f":"IF(Roster!$O$21=BI$2,1,0)","v":0},{"$f":"IF(Roster!$O$21=BJ$2,1,0)","v":0},{"$f":"IF(Roster!$O$21=BK$2,1,0)","v":0},{"$f":"IF(Roster!$O$21=BL$2,1,0)","v":0},{"$f":"IF(Roster!$O$21=BM$2,1,0)","v":1},{"$f":"IF(Roster!$O$21=BN$2,1,0)","v":0},{"$f":"IF(Roster!$O$21=BO$2,1,0)","v":0},{"$f":"IF(Roster!$O$21=BP$2,1,0)","v":0},{"$f":"IF(Roster!$O$21=BQ$2,1,0)","v":0},{"$f":"IF(Roster!$P$21=BR$2,1,0)","v":0},{"$f":"IF(Roster!$P$21=BS$2,1,0)","v":0},{"$f":"IF(Roster!$P$21=BT$2,1,0)","v":0},{"$f":"IF(Roster!$P$21=BU$2,1,0)","v":0},{"$f":"IF(Roster!$P$21=BV$2,1,0)","v":0},{"$f":"IF(Roster!$P$21=BW$2,1,0)","v":1},{"$f":"IF(Roster!$P$21=BX$2,1,0)","v":0},{"$f":"IF(Roster!$P$21=BY$2,1,0)","v":0},{"$f":"IF(Roster!$P$21=BZ$2,1,0)","v":0},{"$f":"IF(Roster!$P$21=CA$2,1,0)","v":0},{"$f":"IF(Roster!$P$21=CB$2,1,0)","v":0},{"$f":"IF(Roster!$P$21=CC$2,1,0)","v":0}]
[{"$f":"Roster!K16","v":8},{"$f":"Roster!L16","v":9},{"$f":"Roster!M16","v":10},{"$f":"Roster!N16","v":11},{"$f":"Roster!O16","v":12},{"$f":"Roster!P16","v":1},null,null,null,{"$f":"SUM(J4:J17)","v":2},2,2,1,0,0,2,2,2,1,0,0,0,2,2,2,1,0,0,2,2,2,1,0,0,0,2,2,2,1,0,0,{"$f":"SUM(AP4:AP17)","v":2},2,2,1,1,0,0,2,2,2,1,0,0,2,2,2,2,1,0,0,2,2,2,1,0,0,2,2,2,2,1,0,{"$f":"SUM(BV4:BV17)","v":0},{"$f":"SUM(BW4:BW17)","v":2},2,2,1,0,0,2]
[{"$f":"Roster!K17","v":2},{"$f":"Roster!L17","v":3},{"$f":"Roster!M17","v":4},{"$f":"Roster!N17","v":5},{"$f":"Roster!O17","v":6},{"$f":"Roster!P17","v":7}]
[{"$f":"Roster!K18","v":9},{"$f":"Roster!L18","v":10},{"$f":"Roster!M18","v":11},{"$f":"Roster!N18","v":12},{"$f":"Roster!O18","v":1},{"$f":"Roster!P18","v":2}]
[{"$f":"Roster!K19","v":3},{"$f":"Roster!L19","v":4},{"$f":"Roster!M19","v":5},{"$f":"Roster!N19","v":6},{"$f":"Roster!O19","v":7},{"$f":"Roster!P19","v":8}]
[{"$f":"Roster!K20","v":10},{"$f":"Roster!L20","v":11},{"$f":"Roster!M20","v":12},{"$f":"Roster!N20","v":1},{"$f":"Roster!O20","v":2},{"$f":"Roster!P20","v":3}]
[{"$f":"Roster!K21","v":4},{"$f":"Roster!L21","v":5},{"$f":"Roster!M21","v":6},{"$f":"Roster!N21","v":7},{"$f":"Roster!O21","v":8},{"$f":"Roster!P21","v":6}]

{"sheet":"Tables","index":4,"n_rows":169,"n_cols":19,"rows_kept":169,"cut":false,"hidden":true,"merged":[[35,0,35,10]]}
["Itinerary","Day 2","Day 3","Day 4","Day 5","Day 6","Day 7","Day 8","Day 9","Day 10","Day 11",null,"CAMP NAME","Type","Showers","Commissary","Trading Post","Trail Camp","Dry Camp"]
["12-1","Toothache Springs","Urraca","Stockade Ridge","Miners Park","Black Mountain","Beaubien","Porcupine","Divide","Clear Creek","Tolby Headwaters",null,"Abreu","S","Y","","","",""]
["12-2","Lovers Leap","Miners Park","Lower Bonito","Lost Cabins","Crooked Creek","Wild Horse","Mount Phillips","Cyphers Mine","Hunting Lodge","Clarks Fork",null,"Agua Fria","T","","","","Y",""]
["12-3","Toothache Springs","Urraca","Stockade Ridge","Miners Park","Black Mountain","Divide","Sawmill","Lamberts Mine","Cimarroncito","Cimarroncito",null,"Aguila","T","","","","Y",""]
["12-4","Lovers Leap","Miners Park","Beaubien","Beaubien","Comanche Creek","Comanche Peak","Sawmill","Cyphers Mine","Cimarroncito","Shaefers Pass",null,"American Creek","T",null,null,null,"Y",""]
["12-5","House Canyon","Indian Writings","Horse Canyon","Ponil","Pueblano","Black Horse Creek","Black Horse Creek","Head of Dean","New Dean","Cimarroncita",null,"Anasazi","T","","","","Y",""]
["12-6","Rimrock Park","Crags","Agua Fria","Apache Springs","Crooked Creek","Red Hills","Beaubien","Beaubien","Miners Park","Stockade Ridge",null,"Apache Springs","S","","Y","","",""]
["12-7","Rimrock Park","Crags","Apache Springs","Wild Horse","Comanche Creek","Beaubien","Beaubien","Bear Caves","Miners Park","Shaefers Pass",null,"Arrowhead","T",null,null,null,"Y","Y"]
["12-8","Heck Meadow","Cimarroncito","Thunder Ridge","Clear Creek","Porcupine","Beaubien","Beaubien","Bear Caves","Urraca","Tooth Ridge",null,"Aspen Springs","T","","","","Y",""]
["12-9","Cimarron River","Black Jacks","Elkhorn","Ponil","Metcalf Station","Dan Beard","Pueblano Ruins","Copper Park","Copper Park","Miranda",null,"Azurite","T",null,null,null,"Y","Y"]
["12-10","Flume Canyon","Pueblano Ruins","Baldy Town","Baldy Town","Ringtail","Elkhorn","Ponil","Indian Writings","House Canyon","Chase Cow",null,"Backache Springs","T","","","","Y",""]
["12-11","Arrowhead","Hunting Lodge","Cyphers Mine","Clear Creek","Beaubien","Lower Bonito","Abreu","Bear Caves","Miners Park","Tooth Ridge",null,"Baldy Skyline","T","","","","Y",""]
["12-12","Line","Lower Bonito","Fish Camp","Apache Springs","Comanche Creek","Red Hills","Beaubien","Beaubien","Miners Park","Tooth Ridge",null,"Baldy Town","S","Y","Y","Y","",""]
["12-13","Backache Springs","Line","Agua Fria","Apache Springs","Porcupine","Beaubien","Divide","Black Mountain","Miners Park","Stockade Ridge",null,"Base","S","","","","Y",""]
["12-14","Abreu","Crater Lake","Beaubien","Beaubien","Bear Creek","Crooked Creek","Red Hills","Hunting Lodge","Clarks Fork","Tooth Ridge",null,"Bear Canyon","T","","","","Y",""]
["12-15","Toothache Springs","Crater Lake","Phillips Junction","Agua Fria","Apache Springs","Crooked Creek","Mount Phillips","Thunder Ridge","Cyphers Mine","Clarks Fork",null,"Bear Caves","T","","","","Y",""]
["12-16","Horse Canyon","Metcalf Station","Dan Beard","Ring Place","Iris Park","Upper Greenwood","Baldy Town","Miranda","Baldy Skyline","Ponil",null,"Bear Creek","T","","","","Y",""]
["12-17","Magpie","Urraca","Crater Lake","Lost Cabins","Wild Horse","Mount Phillips","Sawmill","Cyphers Mine","Clarks Fork","Shaefers Pass",null,"Beatty Lakes","T","","","","Y","Y"]
["12-18","House Canyon","Chase Cow","Coyote Howl","Dan Beard","Ring Place","Iris Park","Rich Cabins","Ewells Park","Ewells Park","Maxwell",null,"Beaubien","S","Y","","","",""]
["12-19","Heck Meadow","Cimarroncito","Cyphers Mine","Mount Phillips","Comanche Creek","Apache Springs","Buck Creek","Lower Bonito","Urraca","Stockade Ridge",null,"Bent","T","","","","Y",""]
["12-20","Herradura","Miners Park","Clarks Fork","Deer Lake","Cimarroncita","Ringtail","Placer","Placer","Pueblano Ruins","Ponil",null,"Black Horse","T","","","","Y",""]
["12-21","Arrowhead","Cimarroncito","Cyphers Mine","Comanche Peak","Crooked Creek","Lost Cabins","Abreu","Bear Caves","Miners Park","Tooth Ridge",null,"Black Horse Creek","T","","","","Y",""]
["12-22","Magpie","Abreu","Fish Camp","Bear Creek","Wild Horse","Comanche Peak","Sawmill","Cyphers Mine","Cimarroncito","Ponderosa Park",null,"Black Horse Mine","T",null,null,null,"Y","Y"]
["12-23","Little Twin","Indian Writings","Rabbit Ear","Ring Place","Iris Park","Rich Cabins","Flume Canyon","French Henry","Black Horse Mine","Miranda",null,"Black Jacks","T","","","","Y",""]
["12-24","Magpie","Urraca","Aguila","Miners Park","Black Mountain","Bear Creek","Wild Horse","Divide","Cyphers Mine","Clarks Fork",null,"Black Mountain","S","","","","",""]
["12-25","New Dean","Pueblano","Rich Cabins","Middle Ponil","Middle Ponil","Ring Place","Beatty Lakes","Rabbit Ear","Metcalf Station","Chase Cow",null,"Bluestem","T",null,null,null,"Y","Y"]
["12-26","Trail Canyon","Dean Skyline","Pueblano","Copper Park","Greenwood Canyon","Ring Place","Beatty Lakes","Rich Cabins","Ponil","McBride Canyon",null,"Bonita Cow","T","","","","Y",""]
["12-27","Hells Fire Canyon","Chase Cow","Coyote Howl","Rabbit Ear","Ring Place","Greenwood Canyon","Azurite","Miranda","Pueblano","Sioux",null,"Buck Creek","T","","","","Y",""]
["12-28","Hells Fire Canyon","Indian Writings","Ponil","Dean Cow","Harlan","Devil's Wash Basin","Sawmill","Comanche Peak","Hunting Lodge","Tooth Ridge",null,"Camping HQ","T","","","","Y",""]
["12-29","Bluestem","Pueblano Ruins","Baldy Town","Baldy Town","Mistletoe","Cimarroncita","Whistle Punk","Red Hills","Beaubien","Shaefers Pass",null,"Campos Heck","T","","","","Y",""]
["12-30","Bluestem","Pueblano","Azurite","Greenwood Canyon","Little Costilla","Little Costilla","Ring Place","Dan Beard","Coyote Howl","Chase Cow",null,"Carson Meadows","S","","","","",""]
["12-31","Heck Meadow","Clarks Fork","Clarks Fork","Lamberts Mine","Sawmill","Cimarroncita","Elkhorn","Ewells Park","Ewells Park","Maxwell",null,"Cathedral Rock","T","","","","Y",""]
["12-32","McBride Canyon","Metcalf Station","Sioux","Pueblano","Maxwell","Maxwell","Black Jacks","Harlan","Hunting Lodge","Ponderosa Park",null,"Chase Canyon","T","","","","Y",""]
["12-33","Sioux","Rich Cabins","Head of Dean","Copper Park","Copper Park","Elkhorn","Cimarroncita","Whistle Punk","Cimarroncito","Ponderosa Park",null,"Chase Cow","S",null,null,null,"",""]
["12-34","Mistletoe","Baldy Skyline","French Henry","Upper Greenwood","Rich Cabins","Elkhorn","Dean Cow","Harlan","Cimarroncito","Clarks Fork",null,"Chase Ranch","S","","","","","Y"]
["Food Pickups",null,null,null,null,null,null,null,null,null,null,null,"Cimarron River","T","","","","Y",""]
[{"$f":"A1","v":"Itinerary"},"Day 2","Day 3","Day 4","Day 5","Day 6","Day 7","Day 8","Day 9","Day 10","Day 11",null,"Cimarroncita","S",null,null,null,"",""]
[{"$f":"A2","v":"12-1"},"Camping HQ",null,null,"Miners Park",null,null,"Phillips Junction",null,null,null,null,"Cimarroncito","S","Y","","","",""]
[{"$f":"A3","v":"12-2"},"Camping HQ","Miners Park",null,null,"Apache Springs",null,null,null,"Cimarroncito",null,null,"Clarks Fork","S","Y","","","",""]
["12-3","Camping HQ",null,null,"Miners Park",null,null,"Sawmill",null,null,null,null,"Clear Creek","S","","","","",""]
["12-4","Camping HQ","Miners Park",null,null,"Phillips Junction",null,"Sawmill",null,"Cimarroncito",null,null,"Comanche Creek","T","","","","Y",""]
["12-5","Camping HQ",null,null,"Ponil",null,null,"Baldy Town",null,null,"Cimarroncita",null,"Comanche Peak","T","","","","Y","Y"]
["12-6","Camping HQ",null,null,"Apache Springs",null,null,"Phillips Junction",null,"Miners Park",null,null,"Cook Canyon","T","","","","Y",""]
["12-7","Camping HQ",null,"Apache Springs",null,null,"Phillips Junction",null,null,"Miners Park",null,null,"Copper Park","T","","","","Y",""]
["12-8","Camping HQ","Cimarroncito",null,null,null,"Phillips Junction",null,null,null,null,null,"Cottonwood","T","","","","Y",""]
["12-9","Camping HQ",null,null,"Ponil",null,null,null,"Baldy Town",null,null,null,"Coyote Howl","T",null,null,null,"Y"]
["12-10","Camping HQ",null,null,"Baldy Town",null,null,"Ponil",null,null,null,null,"Crags","T","","","","Y",""]
["12-11","Camping HQ",null,"Cimarroncito",null,"Phillips Junction",null,null,null,"Miners Park",null,null,"Crater Lake","S","","","","",""]
["12-12","Camping HQ",null,null,"Apache Springs",null,null,"Phillips Junction",null,"Miners Park",null,null,"Crooked Creek","S","","","","",""]
["12-13","Camping HQ",null,null,"Apache Springs",null,"Phillips Junction",null,null,"Miners Park",null,null,"Cyphers Mine","S","Y","","","",""]
["12-14","Camping HQ",null,null,null,"Phillips Junction",null,null,null,"Cimarroncito",null,null,"Dan Beard","S","","","","",""]
["12-15","Camping HQ",null,"Phillips Junction",null,"Apache Springs",null,null,null,null,"Cimarroncito",null,"Daves Lake","T",null,null,null,"Y",""]
["12-16","Camping HQ",null,null,"Ring Place",null,null,"Baldy Town",null,null,null,null,"Dean Cow","S","Y","","","",""]
["12-17","Camping HQ",null,null,null,"Apache Springs",null,null,null,"Cimarroncito",null,null,"Dean Cutoff","T","","","","Y",""]
["12-18","Camping HQ",null,null,null,"Ring Place",null,null,null,"Baldy Town",null,null,"Dean Heck","T","","","","Y",""]
["12-19","Camping HQ",null,"Cimarroncito",null,null,"Apache Springs",null,"Phillips Junction",null,null,null,"Dean Skyline","T",null,null,null,"Y","Y"]
["12-20","Camping HQ","Miners Park",null,null,"Cimarroncita",null,null,"Baldy Town",null,null,null,"Deer Lake","T","","","","Y",""]
["12-21","Camping HQ",null,"Cimarroncito",null,null,"Apache Springs",null,null,"Miners Park",null,null,"Deer Lake Mesa","T","","","","Y",""]
["12-22","Camping HQ",null,null,"Apache Springs",null,null,"Sawmill",null,"Cimarroncito",null,null,"Demonstration Forest","T","","","","Y","Y"]
["12-23","Camping HQ",null,null,"Ring Place",null,"Rich Cabins",null,null,"Baldy Town",null,null,"Devil's Wash Basin","T","","","","Y","Y"]
["12-24","Camping HQ",null,null,"Miners Park",null,null,"Apache Springs",null,null,null,null,"Divide","T",null,null,null,"Y","Y"]
["12-25","Camping HQ",null,"Rich Cabins",null,null,"Ring Place",null,null,null,null,null,"Elkhorn","T","","","","Y",""]
["12-26","Camping HQ",null,null,"Baldy Town",null,"Ring Place",null,null,"Ponil",null,null,"Ewells Park","T","","","","Y",""]
["12-27","Camping HQ",null,null,null,"Ring Place",null,null,"Baldy Town",null,null,null,"Fish Camp","S","","","","",""]
["12-28","Camping HQ",null,null,"Ponil",null,null,"Sawmill",null,null,null,null,"Flume Canyon","T","","","","Y",""]
["12-29","Camping HQ",null,null,"Baldy Town",null,"Cimarroncita",null,null,"Phillips Junction",null,null,"French Henry","S","","","","",""]
["12-30","Camping HQ",null,"Baldy Town",null,null,null,"Ring Place",null,null,null,null,"Garcia Cow","S",null,null,null,"",""]
["12-31","Camping HQ",null,null,"Cimarroncito",null,"Cimarroncita",null,null,"Baldy Town",null,null,"Greenwood Canyon","T","","","","Y",""]
["12-32","Camping HQ",null,"Ponil",null,null,"Baldy Town",null,null,"Cimarroncito",null,null,"Harlan","S","","","","",""]
["12-33","Camping HQ",null,null,"Baldy Town",null,null,"Cimarroncita",null,"Cimarroncito",null,null,"Hawkeye","T","","","","Y","Y"]
["12-34","Camping HQ",null,"Baldy Town",null,"Rich Cabins",null,null,null,"Cimarroncito",null,null,"Heck Meadow","T",null,null,null,"Y","Y"]
[null,null,null,null,null,null,null,null,null,null,null,null,"Hells Fire Canyon","T","","","","Y",""]
[null,null,null,null,null,null,null,null,null,null,null,null,"Herradura","T","","","","Y","Y"]
[null,null,null,null,null,null,null,null,null,null,null,null,"Horse Canyon","T","","","","Y",""]
[null,null,null,null,null,null,null,null,null,null,null,null,"House Canyon","T","","","","Y",""]
[null,null,null,null,null,null,null,null,null,null,null,null,"Hunting Lodge","T","","","","",""]
[null,null,null,null,null,null,null,null,null,null,null,null,"Indian Writings","S","Y","","","",""]
[null,null,null,null,null,null,null,null,null,null,null,null,"Iris Park","T","","","","Y",""]
[null,null,null,null,null,null,null,null,null,null,null,null,"Kit Carson","S","","","","",""]
[null,null,null,null,null,null,null,null,null,null,null,null,"Lamberts Mine","T","","","","Y",""]
[null,null,null,null,null,null,null,null,null,null,null,null,"Line","T","","","","Y",""]
[null,null,null,null,null,null,null,null,null,null,null,null,"Line Camp","T","","","","Y",""]
[null,null,null,null,null,null,null,null,null,null,null,null,"Little Costilla","T","","","","Y",""]
[null,null,null,null,null,null,null,null,null,null,null,null,"Little Twin","T",null,null,null,"Y","Y"]
[null,null,null,null,null,null,null,null,null,null,null,null,"Lookout Meadow","T","","","","Y",""]
[null,null,null,null,null,null,null,null,null,null,null,null,"Lost Cabins","T","","","","Y",""]
[null,null,null,null,null,null,null,null,null,null,null,null,"Lost Gap","T","","","","Y","Y"]
[null,null,null,null,null,null,null,null,null,null,null,null,"Lovato","T",null,null,null,"Y",""]
[null,null,null,null,null,null,null,null,null,null,null,null,"Lovers Leap","T","","","","Y",""]
[null,null,null,null,null,null,null,null,null,null,null,null,"Lower Bonito","T","","","","Y",""]
[null,null,null,null,null,null,null,null,null,null,null,null,"Lower Sawmill","T","","","","Y",""]
[null,null,null,null,null,null,null,null,null,null,null,null,"Magpie","T",null,null,null,"Y","Y"]
[null,null,null,null,null,null,null,null,null,null,null,null,"Martinez Springs","T","","","","Y",""]
[null,null,null,null,null,null,null,null,null,null,null,null,"Maxwell","T","","","","Y",""]
[null,null,null,null,null,null,null,null,null,null,null,null,"McBride Canyon","T","","","","Y","Y"]
[null,null,null,null,null,null,null,null,null,null,null,null,"McCrystal Creek","T","","","","Y",""]
[null,null,null,null,null,null,null,null,null,null,null,null,"Metcalf Station","S","","","","",""]
[null,null,null,null,null,null,null,null,null,null,null,null,"Middle Ponil","T","","","","Y",""]
[null,null,null,null,null,null,null,null,null,null,null,null,"Miners Park","S","Y","Y","","",""]
[null,null,null,null,null,null,null,null,null,null,null,null,"Minnette Meadows","T","","","","Y","Y"]
[null,null,null,null,null,null,null,null,null,null,null,null,"Miranda","S","","","","",""]
[null,null,null,null,null,null,null,null,null,null,null,null,"Mistletoe","T",null,null,null,"Y","Y"]
[null,null,null,null,null,null,null,null,null,null,null,null,"Mount Phillips","T","","","","Y","Y"]
[null,null,null,null,null,null,null,null,null,null,null,null,"Mt Phillips","T","","","","Y","Y"]
[null,null,null,null,null,null,null,null,null,null,null,null,"New Dean","T","","","","Y",""]
[null,null,null,null,null,null,null,null,null,null,null,null,"North Fork Urraca","T","","","","Y",""]
[null,null,null,null,null,null,null,null,null,null,null,null,"North Ponil","T",null,null,null,"Y",""]
[null,null,null,null,null,null,null,null,null,null,null,null,"Old Abreu","T","","","","Y",""]
[null,null,null,null,null,null,null,null,null,null,null,null,"Old Camp","T","","","","Y",""]
[null,null,null,null,null,null,null,null,null,null,null,null,"Olympia","T","","","","Y",""]
[null,null,null,null,null,null,null,null,null,null,null,null,"Phillips Junction","S","Y","Y","Y","",""]
[null,null,null,null,null,null,null,null,null,null,null,null,"Pinyon Flats","T","","","","Y",""]
[null,null,null,null,null,null,null,null,null,null,null,null,"Placer","T",null,null,null,"Y"]
[null,null,null,null,null,null,null,null,null,null,null,null,"Ponderosa Park","T","","","","Y","Y"]
[null,null,null,null,null,null,null,null,null,null,null,null,"Ponil","S","Y","Y","Y","",""]
[null,null,null,null,null,null,null,null,null,null,null,null,"Porcupine","T","","","","Y",""]
[null,null,null,null,null,null,null,null,null,null,null,null,"Pueblano","S","","","","",""]
[null,null,null,null,null,null,null,null,null,null,null,null,"Pueblano Ruins","T","","","","Y",""]
[null,null,null,null,null,null,null,null,null,null,null,null,"Rabbit Ear","T",null,null,null,"Y","Y"]
[null,null,null,null,null,null,null,null,null,null,null,null,"Rayado","T","","","","Y",""]
[null,null,null,null,null,null,null,null,null,null,null,null,"Rayado Ridge","T","Y","","","Y",""]
[null,null,null,null,null,null,null,null,null,null,null,null,"Rayado River","T","","","","Y",""]
[null,null,null,null,null,null,null,null,null,null,null,null,"Red Hills","T","","","","Y",""]
[null,null,null,null,null,null,null,null,null,null,null,null,"Rich Cabins","S","","Y","","",""]
[null,null,null,null,null,null,null,null,null,null,null,null,"Rimrock Park","T","","","","Y","Y"]
[null,null,null,null,null,null,null,null,null,null,null,null,"Ring Place","S","","Y","","",""]
[null,null,null,null,null,null,null,null,null,null,null,null,"Ringtail","T",null,null,null,"Y","Y"]
[null,null,null,null,null,null,null,null,null,null,null,null,"RMSC","T","","","","Y",""]
[null,null,null,null,null,null,null,null,null,null,null,null,"Rock Springs","T","","","","Y",""]
[null,null,null,null,null,null,null,null,null,null,null,null,"Saladon","T",null,null,null,"Y",""]
[null,null,null,null,null,null,null,null,null,null,null,null,"Santa Claus","S","","","","",""]
[null,null,null,null,null,null,null,null,null,null,null,null,"Sawmill","S","Y","","","",""]
[null,null,null,null,null,null,null,null,null,null,null,null,"Seally Canyon","T","","","","Y","Y"]
[null,null,null,null,null,null,null,null,null,null,null,null,"Shaefers Pass","T","","","","Y","Y"]
[null,null,null,null,null,null,null,null,null,null,null,null,"Shuree Cabin","T","","","","Y",""]
[null,null,null,null,null,null,null,null,null,null,null,null,"Shuree Lodge","T","","","","Y",""]
[null,null,null,null,null,null,null,null,null,null,null,null,"Sioux","T","","","","Y",""]
[null,null,null,null,null,null,null,null,null,null,null,null,"Six Mile Gate","T","","","","Y",""]
[null,null,null,null,null,null,null,null,null,null,null,null,"Slate Hill Heck","T","","","","Y","Y"]
[null,null,null,null,null,null,null,null,null,null,null,null,"Stockade","T","","","","Y",""]
[null,null,null,null,null,null,null,null,null,null,null,null,"Stockade Ridge","T","","","","Y","Y"]
[null,null,null,null,null,null,null,null,null,null,null,null,"Thunder Ridge","T","","","","Y","Y"]
[null,null,null,null,null,null,null,null,null,null,null,null,"Tolby Headwaters","T",null,null,null,"Y",""]
[null,null,null,null,null,null,null,null,null,null,null,null,"Tooth Ridge","T","","","","Y","Y"]
[null,null,null,null,null,null,null,null,null,null,null,null,"Toothache Springs","T","","","","Y",""]
[null,null,null,null,null,null,null,null,null,null,null,null,"Touch-Me-Not Creek","T",null,null,null,"Y",""]
[null,null,null,null,null,null,null,null,null,null,null,null,"Trail Canyon","T","","","","Y",""]
[null,null,null,null,null,null,null,null,null,null,null,null,"Turkey Creek","T","","","","Y",""]
[null,null,null,null,null,null,null,null,null,null,null,null,"Upper Bench","T","","","","Y","Y"]
[null,null,null,null,null,null,null,null,null,null,null,null,"Upper Clarks Fork","T","","","","Y","Y"]
[null,null,null,null,null,null,null,null,null,null,null,null,"Upper Dean Cow","T","","","","Y",""]
[null,null,null,null,null,null,null,null,null,null,null,null,"Upper Greenwood","T","","","","Y",""]
[null,null,null,null,null,null,null,null,null,null,null,null,"Upper Sawmill","T","","","","Y",""]
[null,null,null,null,null,null,null,null,null,null,null,null,"Upper Webster Park","T",null,null,null,"Y",""]
[null,null,null,null,null,null,null,null,null,null,null,null,"Urraca","S","","","","",""]
[null,null,null,null,null,null,null,null,null,null,null,null,"Ute Gulch","S","","Y","Y","",""]
[null,null,null,null,null,null,null,null,null,null,null,null,"Ute Meadows","T","","","","Y",""]
[null,null,null,null,null,null,null,null,null,null,null,null,"Ute Park Pass","T","","","","Y",""]
[null,null,null,null,null,null,null,null,null,null,null,null,"Ute Springs","T","","","","Y",""]
[null,null,null,null,null,null,null,null,null,null,null,null,"Vaca","T","","","","Y",""]
[null,null,null,null,null,null,null,null,null,null,null,null,"Visto Grande","T","","","","Y",""]
[null,null,null,null,null,null,null,null,null,null,null,null,"Webster Lake","T","","","","Y",""]
[null,null,null,null,null,null,null,null,null,null,null,null,"Webster Parks","T","","","","Y","Y"]
[null,null,null,null,null,null,null,null,null,null,null,null,"Whistle Punk","T","","","","Y",""]
[null,null,null,null,null,null,null,null,null,null,null,null,"Whiteman Vega","S","","","","",""]
[null,null,null,null,null,null,null,null,null,null,null,null,"Wild Horse","T","","","","Y",""]
[null,null,null,null,null,null,null,null,null,null,null,null,"Wild Horse Park","T",null,null,null,"Y",""]
[null,null,null,null,null,null,null,null,null,null,null,null,"Window Rock","T","","","","Y","Y"]
[null,null,null,null,null,null,null,null,null,null,null,null,"Zastrow","S","Y","Y","","",""]