{"text_format":"1","workbook":"xlsx","n_sheets":5,"sheets":["Instructions","Roster","Duty Roster","Calculator","Tables"],"not_rendered":{"charts":0,"images":1,"macros":1,"external_links":0,"defined_names":24,"comments":0,"pivot_tables":0},"unopened":[],"bounds":{"document_bytes":16777216,"sheet_cells":100000,"rows_first":2000,"rows_last":500,"rows_between":2000,"halvings":0,"cell_chars":16384,"cell_head_chars":4096},"cells_cut":0,"cells_raw":0,"read":"whole","date_system":"1900"}

{"sheet":"Instructions","index":0,"n_rows":13,"n_cols":3,"rows_kept":13,"cut":false,"hidden":false,"merged":[[12,0,12,2],[8,0,8,2],[2,0,2,2],[0,0,0,2],[11,0,11,2],[1,0,1,2]]}
["Philmont Trek Duty Roster Instructions"]
["12-Day Treks"]
["This spreadsheet was developed to produce duty rosters for a Philmont Trek.  Any number of participants may be included in the Duty Roster (up to the crew maximum size of 12).  The spreadsheet has a number of \"tabs\" for different worksheets.  These are used as follows:"]
[1,"Instructions","This worksheet, instructions on using the spreadsheet."]
[2,"Roster","    This is the worksheet where information is entered.  Move between cells by using the TAB key.  Information is entered in the cells that are shaded light green.\n    Enter the names of the crewmembers that will have duty roster duties (last name first, separated with a comma).  After the names have been entered, enter the crew member number in the grid for job assignments (i.e., 1, 2, ...4, etc.).  Up to two crew members may be assigned to a job on any given day.\n    As you enter crew member numbers in the grid, the total number of job assignments they have will show in gray to the right of their name and the \ntable below the entry area will show a running total of assignments by person & job.\n    The campsites are based on the Philmont 2024 Itinerary Guidebook and are updated when you enter your itinerary number."]
[3,"Duty Roster","This worksheet is the printable duty roster.  It is formatted for 8-1/2 x 11 paper in landscape mode.  It is suggested that a copy be printed and laminated (possibly reduced in size) for each member of the crew."]
{"$rows_left_out":8}
{"sheet":"Roster","index":1,"n_rows":36,"n_cols":17,"rows_kept":36,"cut":false,"hidden":false,"merged":[[27,8,27,9],[33,8,33,9],[34,8,34,9],[28,8,28,9],[29,8,29,9],[30,8,30,9],[31,8,31,9],[32,8,32,9],[0,16,20,16],[24,3,24,4],[21,10,22,10],[17,3,17,4],[21,16,22,16],[22,6,35,6],[35,7,35,9],[21,15,22,15],[21,13,22,13],[21,8,22,9],[21,11,22,11],[21,7,22,7],[15,3,15,4],[16,3,16,4],[21,12,22,12],[23,8,23,9],[14,3,14,4],[25,8,25,9],[26,8,26,9],[18,3,18,4],[19,3,19,4],[20,3,20,4],[24,8,24,9],[22,1,26,1],[21,14,22,14],[21,3,21,4],[22,3,22,4],[23,3,23,4]]}
["#","Name","LastName","FirstName","Jobs",null,"Trek Day #","Day","Date","Campsite","Water","Stoves Fuel","Meal Cleanup","Site Setup","Bear Bags","Cook Dinner","Assign daily jobs to crewmembers by entering crewmember # \nin the job column for the day of the trek."]
[{"$f":"IF(ISBLANK(B2),\"\",1)","v":1},"Farkel, Fred",{"$f":"IF(ISBLANK(B2),\"\",LEFT(B2,SEARCH(\",\",B2)-1))","v":"Farkel"},{"$f":"IF(ISBLANK(B2),\"\",RIGHT(B2,LEN(B2)-SEARCH(\",\",B2)-1))","v":"Fred"},{"$f":"Calculator!I4","v":7},null,2,{"$f":"INDEX(week_days,WEEKDAY(I2,1),2)","v":"Sun"},{"$f":"Arrival+G2-1","v":"2024-06-09"},{"$f":"IF(VLOOKUP(INDEX(Campsite,G2-1),campInfo,2)=\"S\",UPPER(INDEX(Campsite,G2-1)),INDEX(Campsite,G2-1))","v":"Toothache Springs"},1,2,3,4,5,6]
[{"$f":"IF(ISBLANK(B3),\"\",A2+1)","v":2},"Jones, Davey",{"$f":"IF(ISBLANK(B3),\"\",LEFT(B3,SEARCH(\",\",B3)-1))","v":"Jones"},{"$f":"IF(ISBLANK(B3),\"\",RIGHT(B3,LEN(B3)-SEARCH(\",\",B3)-1))","v":"Davey"},{"$f":"Calculator!I5","v":7},null,null,null,null,null,7,8,9,10,11,12]
[{"$f":"IF(ISBLANK(B4),\"\",A3+1)","v":3},"Brown, Sam","Brown","Sam",{"$f":"Calculator!I6","v":7},null,3,{"$f":"INDEX(week_days,WEEKDAY(I4,1),2)","v":"Mon"},{"$f":"Arrival+G4-1","v":"2024-06-10"},{"$f":"IF(VLOOKUP(INDEX(Campsite,G4-1),campInfo,2)=\"S\",UPPER(INDEX(Campsite,G4-1)),INDEX(Campsite,G4-1))","v":"URRACA"},2,3,4,5,6,7]
[4,"Washington, George","Washington","George",{"$f":"Calculator!I7","v":7},null,null,null,null,null,8,9,10,11,12,1]
[5,"Kiddlehopper, Clem","Kiddlehopper","Clem",{"$f":"Calculator!I8","v":7},null,4,"Tue",{"$f":"Arrival+G6-1","v":"2024-06-11"},{"$f":"IF(VLOOKUP(INDEX(Campsite,G6-1),campInfo,2)=\"S\",UPPER(INDEX(Campsite,G6-1)),INDEX(Campsite,G6-1))","v":"Stockade Ridge"},3,4,5,6,7,8]
{"$rows_left_out":31}
{"sheet":"Duty Roster","index":2,"n_rows":23,"n_cols":14,"rows_kept":23,"cut":false,"hidden":false,"merged":[[21,7,22,7],[21,2,22,2],[21,4,22,4],[17,7,18,7],[19,7,20,7],[19,6,20,6],[17,4,18,4],[19,4,20,4],[19,5,20,5],[21,6,22,6],[19,0,20,0],[17,2,18,2],[19,2,20,2],[13,2,14,2],[19,1,20,1],[17,5,18,5],[17,6,18,6],[15,0,16,0],[17,0,18,0],[21,0,22,0],[21,1,22,1],[15,5,16,5],[21,5,22,5],[1,13,2,13],[3,0,4,0],[3,1,4,1],[3,2,4,2],[3,7,4,7],[13,7,14,7],[15,7,16,7],[15,2,16,2],[13,4,14,4],[5,5,6,5],[5,6,6,6],[5,7,6,7],[9,6,10,6],[9,7,10,7],[11,7,12,7],[11,6,12,6],[0,3,0,12],[0,0,0,2],[3,4,4,4],[3,5,4,5],[3,6,4,6],[5,0,6,0],[5,4,6,4],[5,2,6,2],[5,1,6,1],[7,7,8,7],[7,0,8,0],[7,1,8,1],[7,2,8,2],[7,4,8,4],[7,5,8,5],[7,6,8,6],[9,0,10,0],[9,1,10,1],[9,2,10,2],[9,4,10,4],[9,5,10,5],[11,1,12,1],[11,2,12,2],[11,4,12,4],[11,5,12,5],[13,0,14,0],[11,0,12,0],[17,1,18,1],[15,1,16,1],[13,1,14,1],[13,6,14,6],[15,6,16,6],[15,4,16,4],[13,5,14,5]]}
[{"$f":"\"Expedition # \" & Expedition","v":"Expedition # 608-A"},null,null,"Philmont Trek Duty Roster",null,null,null,null,null,null,null,null,null,{"$f":"Unit","v":"Troop 123"}]
[{"$f":"\"Itinerary # \" & itineraryNumber","v":"Itinerary # 12-1"},null,null,null,null,null,null,null,null,null,null,null,null,"Cook Dinner"]
["Trek Day #","Day","Date","Campsite\n     Food Pickup","Sh","Com","T.P.","Dry","Water","Stoves/Fuel","Meal Cleanup","Site Setup","Bear Bags"]
[2,{"$f":"Roster!H2","v":"Sun"},{"$f":"Roster!I2","v":"2024-06-09"},{"$f":"Roster!J2","v":"Toothache Springs"},{"$f":"UPPER(VLOOKUP($D4,campInfo,3))","v":""},{"$f":"UPPER(VLOOKUP($D4,campInfo,4))","v":""},{"$f":"UPPER(VLOOKUP($D4,campInfo,5))","v":""},{"$f":"UPPER(VLOOKUP($D4,campInfo,7))","v":""},{"$f":"IF(INDEX(assignments,ROW($I4)-ROW(I$3),COLUMN(I4)-COLUMN($H4))<1,\"\",INDEX(FirstNames,INDEX(assignments,ROW($I4)-ROW(I$3),COLUMN(I4)-COLUMN($H4)),1))","v":"Fred"},"Davey","Sam","George","Clem","George W."]
[null,null,null,{"$f":"INDEX(foodPickups,numericItinerary(itineraryNumber),A$4-1)","v":"Camping HQ"},null,null,null,null,{"$f":"IF(INDEX(assignments,ROW($I5)-ROW(I$3),COLUMN(I5)-COLUMN($H5))<1,\"\",INDEX(FirstNames,INDEX(assignments,ROW($I5)-ROW(I$3),COLUMN(I5)-COLUMN($H5)),1))","v":"Abe"},"Ike","John","Bill","Waite","George"]
[3,{"$f":"Roster!H4","v":"Mon"},{"$f":"Roster!I4","v":"2024-06-10"},{"$f":"Roster!J4","v":"URRACA"},{"$f":"UPPER(VLOOKUP($D6,campInfo,3))","v":""},{"$f":"UPPER(VLOOKUP($D6,campInfo,4))","v":""},{"$f":"UPPER(VLOOKUP($D6,campInfo,5))","v":""},{"$f":"UPPER(VLOOKUP($D6,campInfo,7))","v":""},"Davey","Sam","George","Clem","George W.","Abe"]
{"$rows_left_out":18}
{"sheet":"Calculator","index":3,"n_rows":23,"n_cols":84,"rows_kept":23,"cut":false,"hidden":true,"merged":[[18,6,18,7],[1,8,2,8],[1,0,1,5],[17,6,17,7]]}
[null,null,null,null,null,null,null,null,null,{"$f":"A3","v":"Water"},null,null,null,null,null,null,null,null,null,null,null,{"$f":"B3","v":"Stoves Fuel"},null,null,null,null,null,null,null,null,null,null,null,{"$f":"C3","v":"Meal Cleanup"},null,null,null,null,null,null,null,null,null,null,null,{"$f":"D3","v":"Site Setup"},null,null,null,null,null,null,null,null,null,null,null,{"$f":"E3","v":"Bear Bags"},null,null,null,null,null,null,null,null,null,null,null,{"$f":"F3","v":"Cook Dinner"}]
["Participant's assigned to jobs by day (from Roster):",null,null,null,null,null,"Assignments:",null,"Total Jobs",{"$f":"$G$4","v":1},{"$f":"$G$5","v":2},{"$f":"$G$6","v":3},{"$f":"$G$7","v":4},{"$f":"$G$8","v":5},{"$f":"$G$9","v":6},{"$f":"$G$10","v":7},{"$f":"$G$11","v":8},{"$f":"$G$12","v":9},{"$f":"$G$13","v":10},{"$f":"$G$14","v":11},{"$f":"$G$15","v":12},{"$f":"$G$4","v":1},{"$f":"$G$5","v":2},{"$f":"$G$6","v":3},{"$f":"$G$7","v":4},{"$f":"$G$8","v":5},{"$f":"$G$9","v":6},{"$f":"$G$10","v":7},{"$f":"$G$11","v":8},{"$f":"$G$12","v":9},{"$f":"$G$13","v":10},{"$f":"$G$14","v":11},{"$f":"$G$15","v":12},{"$f":"$G$4","v":1},{"$f":"$G$5","v":2},{"$f":"$G$6","v":3},{"$f":"$G$7","v":4},{"$f":"$G$8","v":5},{"$f":"$G$9","v":6},{"$f":"$G$10","v":7},{"$f":"$G$11","v":8},{"$f":"$G$12","v":9},{"$f":"$G$13","v":10},{"$f":"$G$14","v":11},{"$f":"$G$15","v":12},{"$f":"$G$4","v":1},{"$f":"$G$5","v":2},{"$f":"$G$6","v":3},{"$f":"$G$7","v":4},{"$f":"$G$8","v":5},{"$f":"$G$9","v":6},{"$f":"$G$10","v":7},{"$f":"$G$11","v":8},{"$f":"$G$12","v":9},{"$f":"$G$13","v":10},{"$f":"$G$14","v":11},{"$f":"$G$15","v":12},{"$f":"$G$4","v":1},{"$f":"$G$5","v":2},{"$f":"$G$6","v":3},{"$f":"$G$7","v":4},{"$f":"$G$8","v":5},{"$f":"$G$9","v":6},{"$f":"$G$10","v":7},{"$f":"$G$11","v":8},{"$f":"$G$12","v":9},{"$f":"$G$13","v":10},{"$f":"$G$14","v":11},{"$f":"$G$15","v":12},{"$f":"$G$4","v":1},{"$f":"$G$5","v":2},{"$f":"$G$6","v":3},{"$f":"$G$7","v":4},{"$f":"$G$8","v":5},{"$f":"$G$9","v":6},{"$f":"$G$10","v":7},{"$f":"$G$11","v":8},{"$f":"$G$12","v":9},{"$f":"$G$13","v":10},{"$f":"$G$14","v":11},{"$f":"$G$15","v":12}]
[{"$f":"Roster!K1","v":"Water"},{"$f":"Roster!L1","v":"Stoves Fuel"},{"$f":"Roster!M1","v":"Meal Cleanup"},{"$f":"Roster!N1","v":"Site Setup"},{"$f":"Roster!O1","v":"Bear Bags"},{"$f":"Roster!P1","v":"Cook Dinner"},"Person #","Name",null,{"$f":"$H$4","v":"Fred"},{"$f":"$H$5","v":"Davey"},{"$f":"$H$6","v":"Sam"},{"$f":"$H$7","v":"George"},{"$f":"$H$8","v":"Clem"},{"$f":"$H$9","v":"George W."},{"$f":"$H$10","v":"Abe"},{"$f":"$H$11","v":"Ike"},{"$f":"$H$12","v":"John"},{"$f":"$H$13","v":"Bill"},{"$f":"$H$14","v":"Waite"},{"$f":"$H$15","v":"George"},{"$f":"$H$4","v":"Fred"},{"$f":"$H$5","v":"Davey"},{"$f":"$H$6","v":"Sam"},{"$f":"$H$7","v":"George"},{"$f":"$H$8","v":"Clem"},{"$f":"$H$9","v":"George W."},{"$f":"$H$10","v":"Abe"},{"$f":"$H$11","v":"Ike"},{"$f":"$H$12","v":"John"},{"$f":"$H$13","v":"Bill"},{"$f":"$H$14","v":"Waite"},{"$f":"$H$15","v":"George"},{"$f":"$H$4","v":"Fred"},{"$f":"$H$5","v":"Davey"},{"$f":"$H$6","v":"Sam"},{"$f":"$H$7","v":"George"},{"$f":"$H$8","v":"Clem"},{"$f":"$H$9","v":"George W."},{"$f":"$H$10","v":"Abe"},{"$f":"$H$11","v":"Ike"},{"$f":"$H$12","v":"John"},{"$f":"$H$13","v":"Bill"},{"$f":"$H$14","v":"Waite"},{"$f":"$H$15","v":"George"},{"$f":"$H$4","v":"Fred"},{"$f":"$H$5","v":"Davey"},{"$f":"$H$6","v":"Sam"},{"$f":"$H$7","v":"George"},{"$f":"$H$8","v":"Clem"},{"$f":"$H$9","v":"George W."},{"$f":"$H$10","v":"Abe"},{"$f":"$H$11","v":"Ike"},{"$f":"$H$12","v":"John"},{"$f":"$H$13","v":"Bill"},{"$f":"$H$14","v":"Waite"},{"$f":"$H$15","v":"George"},{"$f":"$H$4","v":"Fred"},{"$f":"$H$5","v":"Davey"},{"$f":"$H$6","v":"Sam"},{"$f":"$H$7","v":"George"},{"$f":"$H$8","v":"Clem"},{"$f":"$H$9","v":"George W."},{"$f":"$H$10","v":"Abe"},{"$f":"$H$11","v":"Ike"},{"$f":"$H$12","v":"John"},{"$f":"$H$13","v":"Bill"},{"$f":"$H$14","v":"Waite"},{"$f":"$H$15","v":"George"},{"$f":"$H$4","v":"Fred"},{"$f":"$H$5","v":"Davey"},{"$f":"$H$6","v":"Sam"},{"$f":"$H$7","v":"George"},{"$f":"$H$8","v":"Clem"},{"$f":"$H$9","v":"George W."},{"$f":"$H$10","v":"Abe"},{"$f":"$H$11","v":"Ike"},{"$f":"$H$12","v":"John"},{"$f":"$H$13","v":"Bill"},{"$f":"$H$14","v":"Waite"},{"$f":"$H$15","v":"George"},null,"Week Days"]
[{"$f":"Roster!K2","v":1},{"$f":"Roster!L2","v":2},{"$f":"Roster!M2","v":3},{"$f":"Roster!N2","v":4},{"$f":"Roster!O2","v":5},{"$f":"Roster!P2","v":6},{"$f":"Roster!A2","v":1},{"$f":"IF(ISBLANK(Roster!D2),\"\",Roster!D2)","v":"Fred"},{"$f":"IF(H4=\"\",\"\",INDEX(Water,18,$G4)+INDEX(Stoves_Fuel,18,$G4)+INDEX(Meal_Cleanup,18,$G4)+INDEX(Site_Setup,18,$G4)+INDEX(Bear_Bags,18,$G4)+INDEX(Cook_Dinner,18,$G4))","v":7},{"$f":"IF(Roster!$K$2=J$2,1,0)","v":1},{"$f":"IF(Roster!$K$2=K$2,1,0)","v":0},{"$f":"IF(Roster!$K$2=L$2,1,0)","v":0},{"$f":"IF(Roster!$K$2=M$2,1,0)","v":0},{"$f":"IF(Roster!$K$2=N$2,1,0)","v":0},{"$f":"IF(Roster!$K$2=O$2,1,0)","v":0},{"$f":"IF(Roster!$K$2=P$2,1,0)","v":0},{"$f":"IF(Roster!$K$2=Q$2,1,0)","v":0},{"$f":"IF(Roster!$K$2=R$2,1,0)","v":0},{"$f":"IF(Roster!$K$2=S$2,1,0)","v":0},{"$f":"IF(Roster!$K$2=T$2,1,0)","v":0},{"$f":"IF(Roster!$K$2=U$2,1,0)","v":0},{"$f":"IF(Roster!$L$2=V$2,1,0)","v":0},{"$f":"IF(Roster!$L$2=W$2,1,0)","v":1},{"$f":"IF(Roster!$L$2=X$2,1,0)","v":0},{"$f":"IF(Roster!$L$2=Y$2,1,0)","v":0},{"$f":"IF(Roster!$L$2=Z$2,1,0)","v":0},{"$f":"IF(Roster!$L$2=AA$2,1,0)","v":0},{"$f":"IF(Roster!$L$2=AB$2,1,0)","v":0},{"$f":"IF(Roster!$L$2=AC$2,1,0)","v":0},{"$f":"IF(Roster!$L$2=AD$2,1,0)","v":0},{"$f":"IF(Roster!$L$2=AE$2,1,0)","v":0},{"$f":"IF(Roster!$L$2=AF$2,1,0)","v":0},{"$f":"IF(Roster!$L$2=AG$2,1,0)","v":0},{"$f":"IF(Roster!$M$2=AH$2,1,0)","v":0},{"$f":"IF(Roster!$M$2=AI$2,1,0)","v":0},{"$f":"IF(Roster!$M$2=AJ$2,1,0)","v":1},{"$f":"IF(Roster!$M$2=AK$2,1,0)","v":0},{"$f":"IF(Roster!$M$2=AL$2,1,0)","v":0},{"$f":"IF(Roster!$M$2=AM$2,1,0)","v":0},{"$f":"IF(Roster!$M$2=AN$2,1,0)","v":0},{"$f":"IF(Roster!$M$2=AO$2,1,0)","v":0},{"$f":"IF(Roster!$M$2=AP$2,1,0)","v":0},{"$f":"IF(Roster!$M$2=AQ$2,1,0)","v":0},{"$f":"IF(Roster!$M$2=AR$2,1,0)","v":0},{"$f":"IF(Roster!$M$2=AS$2,1,0)","v":0},{"$f":"IF(Roster!$N$2=AT$2,1,0)","v":0},{"$f":"IF(Roster!$N$2=AU$2,1,0)","v":0},{"$f":"IF(Roster!$N$2=AV$2,1,0)","v":0},{"$f":"IF(Roster!$N$2=AW$2,1,0)","v":1},{"$f":"IF(Roster!$N$2=AX$2,1,0)","v":0},{"$f":"IF(Roster!$N$2=AY$2,1,0)","v":0},{"$f":"IF(Roster!$N$2=AZ$2,1,0)","v":0},{"$f":"IF(Roster!$N$2=BA$2,1,0)","v":0},{"$f":"IF(Roster!$N$2=BB$2,1,0)","v":0},{"$f":"IF(Roster!$N$2=BC$2,1,0)","v":0},{"$f":"IF(Roster!$N$2=BD$2,1,0)","v":0},{"$f":"IF(Roster!$N$2=BE$2,1,0)","v":0},{"$f":"IF(Roster!$O$2=BF$2,1,0)","v":0},{"$f":"IF(Roster!$O$2=BG$2,1,0)","v":0},{"$f":"IF(Roster!$O$2=BH$2,1,0)","v":0},{"$f":"IF(Roster!$O$2=BI$2,1,0)","v":0},{"$f":"IF(Roster!$O$2=BJ$2,1,0)","v":1},{"$f":"IF(Roster!$O$2=BK$2,1,0)","v":0},{"$f":"IF(Roster!$O$2=BL$2,1,0)","v":0},{"$f":"IF(Roster!$O$2=BM$2,1,0)","v":0},{"$f":"IF(Roster!$O$2=BN$2,1,0)","v":0},{"$f":"IF(Roster!$O$2=BO$2,1,0)","v":0},{"$f":"IF(Roster!$O$2=BP$2,1,0)","v":0},{"$f":"IF(Roster!$O$2=BQ$2,1,0)","v":0},{"$f":"IF(Roster!$P$2=BR$2,1,0)","v":0},{"$f":"IF(Roster!$P$2=BS$2,1,0)","v":0},{"$f":"IF(Roster!$P$2=BT$2,1,0)","v":0},{"$f":"IF(Roster!$P$2=BU$2,1,0)","v":0},{"$f":"IF(Roster!$P$2=BV$2,1,0)","v":0},{"$f":"IF(Roster!$P$2=BW$2,1,0)","v":1},{"$f":"IF(Roster!$P$2=BX$2,1,0)","v":0},{"$f":"IF(Roster!$P$2=BY$2,1,0)","v":0},{"$f":"IF(Roster!$P$2=BZ$2,1,0)","v":0},{"$f":"IF(Roster!$P$2=CA$2,1,0)","v":0},{"$f":"IF(Roster!$P$2=CB$2,1,0)","v":0},{"$f":"IF(Roster!$P$2=CC$2,1,0)","v":0},null,"Sunday","Sun"]
[{"$f":"Roster!K3","v":7},{"$f":"Roster!L3","v":8},{"$f":"Roster!M3","v":9},{"$f":"Roster!N3","v":10},{"$f":"Roster!O3","v":11},{"$f":"Roster!P3","v":12},{"$f":"Roster!A3","v":2},{"$f":"IF(ISBLANK(Roster!D3),\"\",Roster!D3)","v":"Davey"},{"$f":"IF(H5=\"\",\"\",INDEX(Water,18,$G5)+INDEX(Stoves_Fuel,18,$G5)+INDEX(Meal_Cleanup,18,$G5)+INDEX(Site_Setup,18,$G5)+INDEX(Bear_Bags,18,$G5)+INDEX(Cook_Dinner,18,$G5))","v":7},{"$f":"IF(Roster!$K$3=J$2,1,0)","v":0},{"$f":"IF(Roster!$K$3=K$2,1,0)","v":0},{"$f":"IF(Roster!$K$3=L$2,1,0)","v":0},{"$f":"IF(Roster!$K$3=M$2,1,0)","v":0},{"$f":"IF(Roster!$K$3=N$2,1,0)","v":0},{"$f":"IF(Roster!$K$3=O$2,1,0)","v":0},{"$f":"IF(Roster!$K$3=P$2,1,0)","v":1},{"$f":"IF(Roster!$K$3=Q$2,1,0)","v":0},{"$f":"IF(Roster!$K$3=R$2,1,0)","v":0},{"$f":"IF(Roster!$K$3=S$2,1,0)","v":0},{"$f":"IF(Roster!$K$3=T$2,1,0)","v":0},{"$f":"IF(Roster!$K$3=U$2,1,0)","v":0},{"$f":"IF(Roster!$L$3=V$2,1,0)","v":0},{"$f":"IF(Roster!$L$3=W$2,1,0)","v":0},{"$f":"IF(Roster!$L$3=X$2,1,0)","v":0},{"$f":"IF(Roster!$L$3=Y$2,1,0)","v":0},{"$f":"IF(Roster!$L$3=Z$2,1,0)","v":0},{"$f":"IF(Roster!$L$3=AA$2,1,0)","v":0},{"$f":"IF(Roster!$L$3=AB$2,1,0)","v":0},{"$f":"IF(Roster!$L$3=AC$2,1,0)","v":1},{"$f":"IF(Roster!$L$3=AD$2,1,0)","v":0},{"$f":"IF(Roster!$L$3=AE$2,1,0)","v":0},{"$f":"IF(Roster!$L$3=AF$2,1,0)","v":0},{"$f":"IF(Roster!$L$3=AG$2,1,0)","v":0},{"$f":"IF(Roster!$M$3=AH$2,1,0)","v":0},{"$f":"IF(Roster!$M$3=AI$2,1,0)","v":0},{"$f":"IF(Roster!$M$3=AJ$2,1,0)","v":0},{"$f":"IF(Roster!$M$3=AK$2,1,0)","v":0},{"$f":"IF(Roster!$M$3=AL$2,1,0)","v":0},{"$f":"IF(Roster!$M$3=AM$2,1,0)","v":0},{"$f":"IF(Roster!$M$3=AN$2,1,0)","v":0},{"$f":"IF(Roster!$M$3=AO$2,1,0)","v":0},{"$f":"IF(Roster!$M$3=AP$2,1,0)","v":1},{"$f":"IF(Roster!$M$3=AQ$2,1,0)","v":0},{"$f":"IF(Roster!$M$3=AR$2,1,0)","v":0},{"$f":"IF(Roster!$M$3=AS$2,1,0)","v":0},{"$f":"IF(Roster!$N$3=AT$2,1,0)","v":0},{"$f":"IF(Roster!$N$3=AU$2,1,0)","v":0},{"$f":"IF(Roster!$N$3=AV$2,1,0)","v":0},{"$f":"IF(Roster!$N$3=AW$2,1,0)","v":0},{"$f":"IF(Roster!$N$3=AX$2,1,0)","v":0},{"$f":"IF(Roster!$N$3=AY$2,1,0)","v":0},{"$f":"IF(Roster!$N$3=AZ$2,1,0)","v":0},{"$f":"IF(Roster!$N$3=BA$2,1,0)","v":0},{"$f":"IF(Roster!$N$3=BB$2,1,0)","v":0},{"$f":"IF(Roster!$N$3=BC$2,1,0)","v":1},{"$f":"IF(Roster!$N$3=BD$2,1,0)","v":0},{"$f":"IF(Roster!$N$3=BE$2,1,0)","v":0},{"$f":"IF(Roster!$O$3=BF$2,1,0)","v":0},{"$f":"IF(Roster!$O$3=BG$2,1,0)","v":0},{"$f":"IF(Roster!$O$3=BH$2,1,0)","v":0},{"$f":"IF(Roster!$O$3=BI$2,1,0)","v":0},{"$f":"IF(Roster!$O$3=BJ$2,1,0)","v":0},{"$f":"IF(Roster!$O$3=BK$2,1,0)","v":0},{"$f":"IF(Roster!$O$3=BL$2,1,0)","v":0},{"$f":"IF(Roster!$O$3=BM$2,1,0)","v":0},{"$f":"IF(Roster!$O$3=BN$2,1,0)","v":0},{"$f":"IF(Roster!$O$3=BO$2,1,0)","v":0},{"$f":"IF(Roster!$O$3=BP$2,1,0)","v":1},{"$f":"IF(Roster!$O$3=BQ$2,1,0)","v":0},{"$f":"IF(Roster!$P$3=BR$2,1,0)","v":0},{"$f":"IF(Roster!$P$3=BS$2,1,0)","v":0},{"$f":"IF(Roster!$P$3=BT$2,1,0)","v":0},{"$f":"IF(Roster!$P$3=BU$2,1,0)","v":0},{"$f":"IF(Roster!$P$3=BV$2,1,0)","v":0},{"$f":"IF(Roster!$P$3=BW$2,1,0)","v":0},{"$f":"IF(Roster!$P$3=BX$2,1,0)","v":0},{"$f":"IF(Roster!$P$3=BY$2,1,0)","v":0},{"$f":"IF(Roster!$P$3=BZ$2,1,0)","v":0},{"$f":"IF(Roster!$P$3=CA$2,1,0)","v":0},{"$f":"IF(Roster!$P$3=CB$2,1,0)","v":0},{"$f":"IF(Roster!$P$3=CC$2,1,0)","v":1},null,"Monday","Mon"]
[{"$f":"Roster!K4","v":2},{"$f":"Roster!L4","v":3},{"$f":"Roster!M4","v":4},{"$f":"Roster!N4","v":5},{"$f":"Roster!O4","v":6},{"$f":"Roster!P4","v":7},{"$f":"Roster!A4","v":3},{"$f":"IF(ISBLANK(Roster!D4),\"\",Roster!D4)","v":"Sam"},{"$f":"IF(H6=\"\",\"\",INDEX(Water,18,$G6)+INDEX(Stoves_Fuel,18,$G6)+INDEX(Meal_Cleanup,18,$G6)+INDEX(Site_Setup,18,$G6)+INDEX(Bear_Bags,18,$G6)+INDEX(Cook_Dinner,18,$G6))","v":7},{"$f":"IF(Roster!$K$4=J$2,1,0)","v":0},{"$f":"IF(Roster!$K$4=K$2,1,0)","v":1},{"$f":"IF(Roster!$K$4=L$2,1,0)","v":0},{"$f":"IF(Roster!$K$4=M$2,1,0)","v":0},{"$f":"IF(Roster!$K$4=N$2,1,0)","v":0},{"$f":"IF(Roster!$K$4=O$2,1,0)","v":0},{"$f":"IF(Roster!$K$4=P$2,1,0)","v":0},{"$f":"IF(Roster!$K$4=Q$2,1,0)","v":0},{"$f":"IF(Roster!$K$4=R$2,1,0)","v":0},{"$f":"IF(Roster!$K$4=S$2,1,0)","v":0},{"$f":"IF(Roster!$K$4=T$2,1,0)","v":0},{"$f":"IF(Roster!$K$4=U$2,1,0)","v":0},{"$f":"IF(Roster!$L$4=V$2,1,0)","v":0},{"$f":"IF(Roster!$L$4=W$2,1,0)","v":0},{"$f":"IF(Roster!$L$4=X$2,1,0)","v":1},{"$f":"IF(Roster!$L$4=Y$2,1,0)","v":0},{"$f":"IF(Roster!$L$4=Z$2,1,0)","v":0},{"$f":"IF(Roster!$L$4=AA$2,1,0)","v":0},{"$f":"IF(Roster!$L$4=AB$2,1,0)","v":0},{"$f":"IF(Roster!$L$4=AC$2,1,0)","v":0},{"$f":"IF(Roster!$L$4=AD$2,1,0)","v":0},{"$f":"IF(Roster!$L$4=AE$2,1,0)","v":0},{"$f":"IF(Roster!$L$4=AF$2,1,0)","v":0},{"$f":"IF(Roster!$L$4=AG$2,1,0)","v":0},{"$f":"IF(Roster!$M$4=AH$2,1,0)","v":0},{"$f":"IF(Roster!$M$4=AI$2,1,0)","v":0},{"$f":"IF(Roster!$M$4=AJ$2,1,0)","v":0},{"$f":"IF(Roster!$M$4=AK$2,1,0)","v":1},{"$f":"IF(Roster!$M$4=AL$2,1,0)","v":0},{"$f":"IF(Roster!$M$4=AM$2,1,0)","v":0},{"$f":"IF(Roster!$M$4=AN$2,1,0)","v":0},{"$f":"IF(Roster!$M$4=AO$2,1,0)","v":0},{"$f":"IF(Roster!$M$4=AP$2,1,0)","v":0},{"$f":"IF(Roster!$M$4=AQ$2,1,0)","v":0},{"$f":"IF(Roster!$M$4=AR$2,1,0)","v":0},{"$f":"IF(Roster!$M$4=AS$2,1,0)","v":0},{"$f":"IF(Roster!$N$4=AT$2,1,0)","v":0},{"$f":"IF(Roster!$N$4=AU$2,1,0)","v":0},{"$f":"IF(Roster!$N$4=AV$2,1,0)","v":0},{"$f":"IF(Roster!$N$4=AW$2,1,0)","v":0},{"$f":"IF(Roster!$N$4=AX$2,1,0)","v":1},{"$f":"IF(Roster!$N$4=AY$2,1,0)","v":0},{"$f":"IF(Roster!$N$4=AZ$2,1,0)","v":0},{"$f":"IF(Roster!$N$4=BA$2,1,0)","v":0},{"$f":"IF(Roster!$N$4=BB$2,1,0)","v":0},{"$f":"IF(Roster!$N$4=BC$2,1,0)","v":0},{"$f":"IF(Roster!$N$4=BD$2,1,0)","v":0},{"$f":"IF(Roster!$N$4=BE$2,1,0)","v":0},{"$f":"IF(Roster!$O$4=BF$2,1,0)","v":0},{"$f":"IF(Roster!$O$4=BG$2,1,0)","v":0},{"$f":"IF(Roster!$O$4=BH$2,1,0)","v":0},{"$f":"IF(Roster!$O$4=BI$2,1,0)","v":0},{"$f":"IF(Roster!$O$4=BJ$2,1,0)","v":0},{"$f":"IF(Roster!$O$4=BK$2,1,0)","v":1},{"$f":"IF(Roster!$O$4=BL$2,1,0)","v":0},{"$f":"IF(Roster!$O$4=BM$2,1,0)","v":0},{"$f":"IF(Roster!$O$4=BN$2,1,0)","v":0},{"$f":"IF(Roster!$O$4=BO$2,1,0)","v":0},{"$f":"IF(Roster!$O$4=BP$2,1,0)","v":0},{"$f":"IF(Roster!$O$4=BQ$2,1,0)","v":0},{"$f":"IF(Roster!$P$4=BR$2,1,0)","v":0},{"$f":"IF(Roster!$P$4=BS$2,1,0)","v":0},{"$f":"IF(Roster!$P$4=BT$2,1,0)","v":0},{"$f":"IF(Roster!$P$4=BU$2,1,0)","v":0},{"$f":"IF(Roster!$P$4=BV$2,1,0)","v":0},{"$f":"IF(Roster!$P$4=BW$2,1,0)","v":0},{"$f":"IF(Roster!$P$4=BX$2,1,0)","v":1},{"$f":"IF(Roster!$P$4=BY$2,1,0)","v":0},{"$f":"IF(Roster!$P$4=BZ$2,1,0)","v":0},{"$f":"IF(Roster!$P$4=CA$2,1,0)","v":0},{"$f":"IF(Roster!$P$4=CB$2,1,0)","v":0},{"$f":"IF(Roster!$P$4=CC$2,1,0)","v":0},null,"Tuesday","Tue"]
{"$rows_left_out":18}
{"sheet":"Tables","index":4,"n_rows":169,"n_cols":19,"rows_kept":169,"cut":false,"hidden":true,"merged":[[35,0,35,10]]}
["Itinerary","Day 2","Day 3","Day 4","Day 5","Day 6","Day 7","Day 8","Day 9","Day 10","Day 11",null,"CAMP NAME","Type","Showers","Commissary","Trading Post","Trail Camp","Dry Camp"]
["12-1","Toothache Springs","Urraca","Stockade Ridge","Miners Park","Black Mountain","Beaubien","Porcupine","Divide","Clear Creek","Tolby Headwaters",null,"Abreu","S","Y","","","",""]
["12-2","Lovers Leap","Miners Park","Lower Bonito","Lost Cabins","Crooked Creek","Wild Horse","Mount Phillips","Cyphers Mine","Hunting Lodge","Clarks Fork",null,"Agua Fria","T","","","","Y",""]
["12-3","Toothache Springs","Urraca","Stockade Ridge","Miners Park","Black Mountain","Divide","Sawmill","Lamberts Mine","Cimarroncito","Cimarroncito",null,"Aguila","T","","","","Y",""]
["12-4","Lovers Leap","Miners Park","Beaubien","Beaubien","Comanche Creek","Comanche Peak","Sawmill","Cyphers Mine","Cimarroncito","Shaefers Pass",null,"American Creek","T",null,null,null,"Y",""]
["12-5","House Canyon","Indian Writings","Horse Canyon","Ponil","Pueblano","Black Horse Creek","Black Horse Creek","Head of Dean","New Dean","Cimarroncita",null,"Anasazi","T","","","","Y",""]
{"$rows_left_out":163}